{"text_format":"1","workbook":"xlsx","n_sheets":3,"sheets":["TM","Data","REF"],"not_rendered":{"charts":0,"images":10,"macros":1,"external_links":0,"defined_names":1,"comments":0,"pivot_tables":0},"unopened":[],"bounds":{"document_bytes":16777216,"sheet_cells":100000,"rows_first":2000,"rows_last":500,"rows_between":2000,"halvings":0,"cell_chars":16384,"cell_head_chars":4096},"cells_cut":0,"cells_raw":0,"read":"whole","date_system":"1900"}

{"sheet":"TM","index":0,"n_rows":67,"n_cols":16373,"rows_kept":67,"cut":false,"hidden":false,"merged":[[66,5,66,7],[10,5,10,8],[11,5,11,8],[10,11,10,12],[15,5,15,8],[16,5,16,8],[17,5,17,8],[15,11,15,12],[16,11,16,12],[17,11,17,12],[62,5,62,7],[60,5,60,7],[52,4,52,8],[53,4,53,8],[54,4,54,8],[39,10,39,11],[41,10,41,11],[42,10,42,11],[43,10,43,11],[52,10,52,11],[0,2,0,13],[2,4,3,9],[1,12,1,13],[4,4,4,9],[5,4,5,9],[37,5,37,12],[40,10,40,11],[1,14,67,14],[1,1,67,1],[68,2,68,13],[64,5,64,7],[55,4,55,8],[39,4,39,8],[40,4,40,8],[53,10,53,11],[54,10,54,11],[55,10,55,11],[41,4,41,8],[42,4,42,8],[43,4,43,8],[50,4,50,8],[51,10,51,11],[50,10,50,11],[56,4,56,8],[56,10,56,11],[44,4,44,8],[44,10,44,11],[45,4,45,8],[45,10,45,11],[46,4,46,8],[46,10,46,11],[47,4,47,8],[47,10,47,11],[48,4,48,8],[48,10,48,11],[49,10,49,11],[51,4,51,8],[49,4,49,8]]}
[]
[null,null,null,null,null,null,null,null,null,null,null,null,"Version 2022.11.16"]
[null,null,null,null,"ToughMesh Tray Sizing Program"]
[]
[null,null,null,null,"CT INNOVATIONS"]
[null,null,null,null,"8 The Green Suite A Dover, DE 19901 USA"]
[]
[]
[null,null,"Project Information"]
[]
[null,null,null,"Project Name",":",null,null,null,null,"Date",":"]
[null,null,null,"Project Address",":"]
[]
[null,null,"Customer / EPC / Contractor Information"]
[]
[null,null,null,"Company Name",":",null,null,null,null,"Designed by",":"]
[null,null,null,"Company Address",":",null,null,null,null,"Checked by",":"]
[null,null,null,"Contact Details",":",null,null,null,null,"Approved by",":"]
[]
[null,null,"Referencce Code/Standard"]
[]
[null,null,null,null,null,null,null,null,null,null,null,null,null,null,null,null,null,null,null,null,null,null,1]
[]
[null,null,null,null,null,null,null,null," ",null,null,null,null,null,null,null,null,null,null,null,null,null,{"$f":"IF(W22=1,0.5,0.4)","v":0.5}]
[]
[null,null,"Cable Tray Information",null,null,null,null,null,null,null,null,null,null,null,null,null,null,null,null,null,null,null,2]
[]
[null,null,null,"Tray Series",":",{"$f":"INDEX(Data!A3,TM!W28)","v":"TMS"},null,"Material/Finish :",{"$f":"INDEX(Data!E3:E9,TM!W26)","v":"EG"},null,null,null,null,null,null,null,null,null,null,null,null,null,1]
[]
[null,null,null,"Inside Tray Depth (in)",":",{"$f":"INDEX(Data!B3:B6,TM!W30)","v":6},null,"PL -","Plain",null,"TG -","Tough Galvanized",null,null,null,null,null,null,null,null,null,null,3]
[]
[null,null,null,"Inside Tray Width (in)",":",{"$f":"INDEX(Data!C3:C15,TM!W32)","v":12},null,"EG -","Electroplated Zinc",null,"S6 -","Stainless Steel SS6",null,null,null,null,null,null,null,null,null,null,6]
[]
[null,null,null,"Length (ft)",":",{"$f":"INDEX(Data!D3,TM!W34)","v":10},null,"PT -","Painted Finish",null,null,null,null,null,null,null,null,null,null,null,null,null,1]
[]
[null,null,"Cable Information"]
[]
[null,null,null,"Cable Tray No. / Tag",":"]
[]
[null,null,null,"Cable No.","Cable  Type / Description",null,null,null,null,"Cable O.D. (in)","Qty",null,"Weight (lbs/ft)"]
{"$rows_left_out":28}
{"sheet":"Data","index":1,"n_rows":14,"n_cols":8,"rows_kept":14,"cut":false,"hidden":true,"merged":[]}
[null,null,null,null,null,null,"Reference Code/Standard"]
["Product Series","Height","Width","Length","Finish",null,0.5,"NFPA 70 - National Electrical Code (NEC) 50% Fill"]
["TMS",2,2,10,"PL",null,0.4,"Canadian Electrical Code (CEC) 40% Fill"]
[null,4,4,null,"EG"]
[null,6,6,null,"PT"]
[null,null,8,null,"TG"]
[null,null,10,null,"S6"]
[null,null,12]
[null,null,16]
[null,null,18]
[null,null,20]
[null,null,24]
[null,null,28]
[null,null,30]

{"sheet":"REF","index":2,"n_rows":17,"n_cols":4,"rows_kept":17,"cut":false,"hidden":true,"merged":[]}
[]
[null,"Tray Height",4]
[null,"Tray Width",12]
[]
[null,"Total Cross Sectional Area",{"$f":"C2*C3","v":48}]
[null,"Allowable Fill Area",{"$f":"C5*0.5","v":24}]
[]
[null,"Cable #","CT-1"]
[null,"Cable Type","xx"]
[null,"Cable OD",0.25,0.5]
[null,"Qty",10,5]
[null,null,{"$f":"(((C10/2)^2)*3.1416)*C11","v":0.49087500000000001},{"$f":"(((D10/2)^2)*3.1416)*D11","v":0.98175000000000001}]
[null,"Total Cable Cross Sectional Area",{"$f":"C12+D12","v":1.4726250000000001}]
[]
[]
[null,"Remaining Spare %",{"$f":"C13/C6","v":6.1359375000000001E-2}]
[null,null,{"$f":"1-C16","v":0.93864062500000001}]