{"text_format":"1","workbook":"xlsx","n_sheets":7,"sheets":["ProjectData","Summary","DropDowns","Tables","CTI Input Sheet","VE2","TSS"],"not_rendered":{"charts":12,"images":39,"macros":1,"external_links":0,"defined_names":3,"comments":0,"pivot_tables":0},"unopened":[],"bounds":{"document_bytes":16777216,"sheet_cells":100000,"rows_first":2000,"rows_last":500,"rows_between":2000,"halvings":0,"cell_chars":16384,"cell_head_chars":4096},"cells_cut":0,"cells_raw":0,"read":"whole","date_system":"1900"}

{"sheet":"ProjectData","index":0,"n_rows":90,"n_cols":10,"rows_kept":90,"cut":false,"hidden":false,"merged":[[87,7,88,7],[15,4,15,5],[16,4,16,5],[15,7,15,8],[16,7,16,8],[39,7,41,7],[42,7,44,7],[45,7,47,7],[48,7,50,7],[51,7,53,7],[78,4,80,4],[36,4,38,4],[39,4,41,4],[42,4,44,4],[45,4,47,4],[48,4,50,4],[87,1,88,1],[87,4,88,4],[58,13,58,15],[2,1,2,9],[85,1,85,3],[85,4,85,6],[85,13,85,15],[54,7,56,7],[11,4,11,5],[11,1,11,2],[12,7,12,8],[34,1,34,3],[34,4,34,6],[34,7,34,9],[36,7,38,7],[85,7,85,9],[51,4,53,4],[54,4,56,4],[58,4,58,6],[60,4,62,4],[63,4,65,4],[66,4,68,4],[69,4,71,4],[72,4,74,4],[75,4,77,4],[72,1,74,1],[75,1,77,1],[78,1,80,1],[58,1,58,3],[51,1,53,1],[54,1,56,1],[60,1,62,1],[63,1,65,1],[66,1,68,1],[39,1,41,1],[42,1,44,1],[45,1,47,1],[48,1,50,1],[69,1,71,1],[21,1,21,2],[21,4,21,5],[29,13,29,14],[22,7,29,9],[36,1,38,1],[6,5,6,6],[29,17,29,18],[13,16,13,17],[12,4,12,5],[34,13,34,15]]}
[]
[]
[null,"TOUGH Support Savings Calculator"]
[]
[]
[]
[null,null,null,null,"Project Name:","CDK"]
[]
[null,"Project Charateristics:"]
[]
[]
[null,"Skilled Labor Rates ",null,null,"Structural Support Selection",null,null,"Logistics Selection"]
[null,"Discipline","Rates (USD/HR) ",null,"Double Strut (12G)",null,null,"40ft Flat Bed"]
[null,"Cable Tray Installer",75,null,null,null,null,"LTL is not Available for Items Over 10ft Length"]
[null,"Structural Erector",75]
[null,"Design Engineer",75,null,"Structural Support Finish",null,null,"Cover Selection"]
[null,"Input Estimated Project Labor Rates",null,null,"Stainless",null,null,"Not Required"]
[]
[null,"Straight Sections:"]
[]
[]
[null,"10ft or 12ft Straight Section",null,null,"20ft Straight Section"]
[null,"Tray Width (in)","Quantity (Piece)",null,"Tray Width (in)","Quantity (Piece)",null,{"$error":"#VALUE!"}]
[null,6,null,null,6]
[null,9,null,null,9]
[null,12,null,null,12,30]
[null,18,null,null,18]
[null,24,null,null,24]
[null,30,null,null,30]
[null,36,null,null,36,15]
[]
[null,"Fitting Sections:"]
[]
[]
[null,{"$error":"#VALUE!"},null,null,{"$error":"#VALUE!"},null,null,{"$error":"#VALUE!"}]
[null,"HB Width (in)","HB Radius (in) ","QTY (Pieces)","VI Width (in)","VI Radius (in) ","QTY (Pieces)","VO Width (in)","VO Radius (in) ","QTY (Pieces)"]
[null,6,12,null,6,12,null,6,12]
[null,null,24,null,null,24,null,null,24]
[null,null,36,null,null,36,null,null,36]
[null,9,12,null,9,12,null,9,12]
[null,null,24,null,null,24,null,null,24]
[null,null,36,null,null,36,null,null,36]
[null,12,12,3,12,12,4,12,12,4]
[null,null,24,null,null,24,null,null,24]
[null,null,36,null,null,36,null,null,36]
[null,18,12,null,18,12,null,18,12]
[null,null,24,null,null,24,null,null,24]
[null,null,36,null,null,36,null,null,36]
[null,24,12,null,24,12,null,24,12]
[null,null,24,null,null,24,null,null,24]
[null,null,36,null,null,36,null,null,36]
[null,30,12,null,30,12,null,30,12]
[null,null,24,null,null,24,null,null,24]
[null,null,36,null,null,36,null,null,36]
[null,36,12,1,36,12,2,36,12]
[null,null,24,null,null,24,null,null,24]
[null,null,36,null,null,36,null,null,36,2]
[]
[null,{"$error":"#VALUE!"},null,null,{"$error":"#VALUE!"}]
[null,"HT Width (in)","HT Radius (in) ","QTY (Pieces)","HX Width (in)","HX Radius (in) ","QTY (Pieces)"]
[null,6,12,null,6,12]
[null,null,24,null,null,24]
[null,null,36,null,null,36]
[null,9,12,null,9,12]
[null,null,24,null,null,24]
[null,null,36,null,null,36]
[null,12,12,1,12,12]
[null,null,24,null,null,24]
[null,null,36,null,null,36]
[null,18,12,null,18,12]
[null,null,24,null,null,24]
[null,null,36,null,null,36]
[null,24,12,null,24,12]
[null,null,24,null,null,24]
[null,null,36,null,null,36]
[null,30,12,null,30,12]
[null,null,24,null,null,24]
[null,null,36,null,null,36]
[null,36,12,1,36,12]
[null,null,24,null,null,24]
[null,null,36,null,null,36]
[]
[null,"Adjustable Sections:"]
[]
[]
[null,{"$error":"#VALUE!"},null,null,{"$error":"#VALUE!"},null,null,{"$error":"#VALUE!"}]
[null,"Type","Height (in)","QTY","Type","Height (in)","QTY","Type","Height (in)","QTY"]
[null,"Vertical\nAdjustable","4in",null,"Horizontal \nAdjustable","4in",null,"Straight /\nOffset Reducing","4in"]
[null,null,"6in",null,null,"6in",null,null,"6in"]
[null,null,null,2]

{"sheet":"Summary","index":1,"n_rows":348,"n_cols":15,"rows_kept":348,"cut":false,"hidden":false,"merged":[[347,11,350,14],[343,11,345,14],[334,11,336,12],[338,11,340,12],[0,0,42,8],[330,11,332,12],[319,11,321,12],[323,11,325,12],[327,11,328,12],[315,11,317,14]]}
[null,null,null,null,null,null,null,null,null,null,{"$f":"TODAY()","v":"2024-04-01"}]
[]
[]
[]
[null,null,null,null,null,null,null,null,null,null,null,"Tray Length",{"$f":"IF(SUM(ProjectData!C24:C30)>0,\"12ft\",IF(SUM(ProjectData!F24:F30)>0,\"20ft\",\"Both\"))","v":"20ft"}]
[null,null,null,null,null,null,null,null,null,null,null,"Support Type",{"$f":"ProjectData!E13","v":"Double Strut (12G)"}]
[null,null,null,null,null,null,null,null,null,null,null,"Support Finish",{"$f":"ProjectData!E17","v":"Stainless"}]
[null,null,null,null,null,null,null,null,null,null,null,"Linear FT of Tray",{"$f":"SUM(ProjectData!F24:F30*20)+SUM(ProjectData!C24:C30*12)","v":900}]
[null,null,null,null,null,null,null,null,null,null,null,"QTY of Fittings",{"$f":"SUM(ProjectData!D37:D57,ProjectData!G37:G57,ProjectData!J37:J57,ProjectData!D61:D81,ProjectData!G61:G81)","v":18}]
[null,null,null,null,null,null,null,null,null,null,null,"Straight Cost: $/ft",{"$f":"IF(M5=\"20ft\",19,15)","v":19}]
[null,null,null,null,null,null,null,null,null,null,null,"Fitting Cost: Piece",200]
[null,null,null,null,null,null,null,null,null,null,null,"Discount Required NEMA Offset",{"$f":"1-(M26-M17)/(M15+M16)","v":0.55499988526570065}]
[null,null,null,null,null,null,null,null,null,null,null,null,{"$f":"M10*(1-M12)","v":8.4550021799516877}]
[null,null,null,null,null,null,null,null,null,null,null,null,{"$f":"M11*(1-M12)","v":89.000022946859872}]
[null,null,null,null,null,null,null,null,null,null,null,"Tray Cost",{"$f":"M10*M8","v":17100}]
[null,null,null,null,null,null,null,null,null,null,null,"Fitting Cost",{"$f":"M11*M9","v":3600}]
[null,null,null,null,null,null,null,null,null,null,null,"Installation Costs: NEMA",{"$f":"L77","v":15536.215125000002}]
[null,null,null,null,null,null,null,null,null,null,null,"Total Project Cost",{"$f":"SUM(M15:M17)","v":36236.215125000002}]
[null,null,null,null,null,null,null,null,null,null,null,"Tray Cost",{"$f":"M15","v":17100}]
[null,null,null,null,null,null,null,null,null,null,null,"Fitting Cost",{"$f":"M16","v":3600}]
[null,null,null,null,null,null,null,null,null,null,null,"Installation Costs: SSS",{"$f":"L78","v":7526.9326249999995}]
[null,null,null,null,null,null,null,null,null,null,null,"Total Project Cost",{"$f":"SUM(M19:M21)","v":28226.932625000001}]
[null,null,null,null,null,null,null,null,null,null,null,"Tray Cost",{"$f":"M15","v":17100},{"$f":"M23/M8","v":19},{"$f":"N23*LEFT(M5,2)","v":380}]
[null,null,null,null,null,null,null,null,null,null,null,"Fitting Cost",{"$f":"M16","v":3600},{"$f":"M24/M9","v":200}]
[null,null,null,null,null,null,null,null,null,null,null,"Installation Costs: TSS",{"$f":"L76","v":4047.7175000000002}]
[null,null,null,null,null,null,null,null,null,null,null,"Total Project Cost",{"$f":"SUM(M23:M25)","v":24747.717499999999}]
[null,null,null,null,null,null,null,null,null,null,null,"% Saved: Same Price (NEMA)",{"$f":"1-(M26/M18)","v":0.31704463574270725}]
[null,null,null,null,null,null,null,null,null,null,null,"$ Saved: Same Price (NEMA)",{"$f":"M18-M26","v":11488.497625000004}]
[null,null,null,null,null,null,null,null,null,null,null,"% Saved: Same Price (SSS)",{"$f":"1-(M26/M22)","v":0.12325870370762615}]
[null,null,null,null,null,null,null,null,null,null,null,"$ Saved: Same Price (SSS)",{"$f":"M22-M26","v":3479.2151250000024}]
[]
[null,null,null,null,null,null,null,null,null,null,null,"Discount Required: NEMA",{"$f":"M12","v":0.55499988526570065}]
[null,null,null,null,null,null,null,null,null,null,null,"Discounted Tray Total",{"$f":"(M15)*(1-M32)","v":7609.5019619565192},{"$f":"M33/M8","v":8.4550021799516877},{"$f":"N33*LEFT(M5,2)","v":169.10004359903377}]
[null,null,null,null,null,null,null,null,null,null,null,"Fitting Cost",{"$f":"(M16)*(1-M32)","v":1602.0004130434777},{"$f":"M34/M9","v":89.000022946859872}]
[null,null,null,null,null,null,null,null,null,null,null,"Installation Costs: NEMA",{"$f":"L77","v":15536.215125000002}]
[null,null,null,null,null,null,null,null,null,null,null,"Total Project Cost: Check",{"$f":"SUM(M33:M35)","v":24747.717499999999}]
[null,null,null,null,null,null,null,null,null,null,null,"Discount Required: SSS",{"$f":"1-(M26-M40)/(M15+M16)","v":0.16807802536231897}]
[null,null,null,null,null,null,null,null,null,null,null,"Discounted Tray Total",{"$f":"(M23)*(1-M37)","v":14225.865766304345},{"$f":"M38/M8","v":15.806517518115939},{"$f":"N38*LEFT(M5,2)","v":316.13035036231878}]
[null,null,null,null,null,null,null,null,null,null,null,"Fitting Cost",{"$f":"(M24)*(1-M37)","v":2994.9191086956516},{"$f":"M39/M9","v":166.38439492753619}]
[null,null,null,null,null,null,null,null,null,null,null,"Installation Costs: SSS",{"$f":"L78","v":7526.9326249999995}]
[null,null,null,null,null,null,null,null,null,null,null,"Total Project Cost: Check",{"$f":"SUM(M38:M40)","v":24747.717499999999}]
[]
[]
[]
[]
[]
[]
[]
[]
[]
[]
[]
[]
[null,null,null,null,null,null,null,null,null,null,"Project Schedule","Vs NEMA Saved Hours","Vs SSS Saved Hours"]
[null,null,null,null,null,null,null,null,null,null,{"$f":"L99+L109+L119","v":34.586108333333335},{"$f":"L57-L56","v":34.586108333333335},{"$f":"L58-L56","v":11.586108333333335}]
[null,null,null,null,null,null,null,null,null,null,null,{"$f":"L97+L107+L117","v":34.179166666666667},"TSS Install Hours"]
[null,null,null,null,null,null,null,null,null,null,null,{"$f":"L98+L108+L118","v":68.765275000000003},"NEMA Install Hours"]
[null,null,null,null,null,null,null,null,null,null,null,{"$f":"L97+L107+L118","v":45.765275000000003},"SSS Install Hours"]
[]
[]
[]
[]
[null,null,null,null,null,null,null,null,null,null,"Total Pieces"]
[null,null,null,null,null,null,null,null,null,null,{"$f":"L144+L154+L173","v":2229.9889999999996}]
[]
[]
[]
[]
[]
[]
[]
[]
[]
[null,null,null,null,null,null,null,null,null,null,"Total $ Savings","K","M"]
[null,null,null,null,null,null,null,null,null,null,{"$f":"IF(L75>999999,M75,L75)","v":11488.497625},{"$f":"M99+M129+M119+M109+M144+M154+M163+M173","v":11488.497625},{"$f":"M99+M129+M119+M109+M144+M154+M163+M173","v":11488.497625}]
[null,null,null,null,null,null,null,null,null,null,null,{"$f":"M97+M127+M117+M107+M142+M152+M161+M171","v":4047.7175000000002},"TSS Install Cost"]
[null,null,null,null,null,null,null,null,null,null,null,{"$f":"M98+M128+M118+M108+M143+M153+M162+M172","v":15536.215125000002},"NEMA Install Cost"]
[null,null,null,null,null,null,null,null,null,null,null,{"$f":"(M97*1.2)+(M107*1.2)+(M127*1.5)+M143+M153+M162+M118","v":7526.9326249999995},"SSS Install Cost"]
[]
[]
[]
[]
[]
[]
[]
[]
[]
[]
[]
[]
[]
[]
[]
[]
[]
[null,null,null,null,null,null,null,null,null,null,"Structural Design","(Hours)","($ USD)"]
[null,null,null,null,null,null,null,null,null,null,"TSS:",{"$f":"IF(ProjectData!E13=\"Single Strut (12G)\",Tables!O32,IF(ProjectData!E13=\"Double Strut (12G)\",Tables!O32,Tables!O23))","v":14.0625},{"$f":"IF(ProjectData!E13=\"Single Strut (12G)\",Tables!U32,IF(ProjectData!E13=\"Double Strut (12G)\",Tables!U32,Tables!U23))","v":1054.6875}]
[null,null,null,null,null,null,null,null,null,null,"NEMA:",{"$f":"IF(ProjectData!E13=\"Single Strut (12G)\",Tables!N32,IF(ProjectData!E13=\"Double Strut (12G)\",Tables!N32,Tables!N23))","v":25.0625},{"$f":"IF(ProjectData!E13=\"Single Strut (12G)\",Tables!T32,IF(ProjectData!E13=\"Double Strut (12G)\",Tables!T32,Tables!T23))","v":1879.6875}]
[null,null,null,null,null,null,null,null,null,null,"Delta",{"$f":"L98-L97","v":11},{"$f":"M98-M97","v":825}]
[null,null,null,null,null,null,null,null,null,null,"Notes:","Calculated Hours Saved","Calculated Dollars Saved"]
[null,null,null,null,null,null,null,null,null,null,null,"Ref. Chart 1A","Ref. Chart 1B"]
[]
[]
[]
[]
[null,null,null,null,null,null,null,null,null,null,"Structure Installation","(Hours)","($ USD)"]
[null,null,null,null,null,null,null,null,null,null,"TSS:",{"$f":"IF(ProjectData!E13=\"Single Strut (12G)\",Tables!Q32,IF(ProjectData!E13=\"Double Strut (12G)\",Tables!Q32,Tables!Q23))","v":17.75},{"$f":"IF(ProjectData!E13=\"Single Strut (12G)\",Tables!W32,IF(ProjectData!E13=\"Double Strut (12G)\",Tables!W32,Tables!W23))","v":1331.25}]
[null,null,null,null,null,null,null,null,null,null,"NEMA:",{"$f":"IF(ProjectData!E13=\"Single Strut (12G)\",Tables!P32,IF(ProjectData!E13=\"Double Strut (12G)\",Tables!P32,Tables!P23))","v":29.75},{"$f":"IF(ProjectData!E13=\"Single Strut (12G)\",Tables!V32,IF(ProjectData!E13=\"Double Strut (12G)\",Tables!V32,Tables!V23))","v":2231.25}]
[null,null,null,null,null,null,null,null,null,null,"Delta",{"$f":"L108-L107","v":12},{"$f":"M108-M107","v":900}]
[null,null,null,null,null,null,null,null,null,null,"Notes:","Calculated Hours Saved","Calculated Dollars Saved"]
[null,null,null,null,null,null,null,null,null,null,null,"Ref. Chart 2A","Ref. Chart 2B"]
[]
[]
[]
[]
[null,null,null,null,null,null,null,null,null,null,"Tray Installation","(Hours)","($ USD)"]
[null,null,null,null,null,null,null,null,null,null,"TSS:",{"$f":"IF(ProjectData!E13=\"Single Strut (12G)\",Tables!S32+Tables!BV23,IF(ProjectData!E13=\"Double Strut (12G)\",Tables!S32+Tables!BV23,Tables!S23+Tables!BV23))","v":2.3666666666666667},{"$f":"IF(ProjectData!E13=\"Single Strut (12G)\",Tables!Y32+Tables!BX23,IF(ProjectData!E13=\"Double Strut (12G)\",Tables!Y32+Tables!BX23,Tables!Y23+Tables!BX23))","v":177.5}]
[null,null,null,null,null,null,null,null,null,null,"NEMA:",{"$f":"IF(ProjectData!E13=\"Single Strut (12G)\",Tables!R32+Tables!BU23,IF(ProjectData!E13=\"Double Strut (12G)\",Tables!R32+Tables!BU23,Tables!R23+Tables!BU23))","v":13.952775000000001},{"$f":"IF(ProjectData!E13=\"Single Strut (12G)\",Tables!X32+Tables!BW23,IF(ProjectData!E13=\"Double Strut (12G)\",Tables!X32+Tables!BW23,Tables!X23+Tables!BW23))","v":1046.4581250000001}]
[null,null,null,null,null,null,null,null,null,null,"Delta",{"$f":"L118-L117","v":11.586108333333334},{"$f":"M118-M117","v":868.95812500000011}]
[null,null,null,null,null,null,null,null,null,null,"Notes:","Calculated Hours Saved","Calculated Dollars Saved"]
[null,null,null,null,null,null,null,null,null,null,null,"Ref. Chart 3A","Ref. Chart 3B"]
[]
[]
[]
[]
[null,null,null,null,null,null,null,null,null,null,"Structure Materials","Physical Weight","($ USD)"]
[null,null,null,null,null,null,null,null,null,null,"TSS:",{"$f":"IF(ProjectData!E13=\"Single Strut (12G)\",Tables!H32,IF(ProjectData!E13=\"Double Strut (12G)\",Tables!H32,Tables!H23))","v":37.274999999999999},{"$f":"IF(ProjectData!E13=\"Single Strut (12G)\",Tables!J32,IF(ProjectData!E13=\"Double Strut (12G)\",Tables!J32,Tables!J23))","v":447.3}]
[null,null,null,null,null,null,null,null,null,null,"NEMA:",{"$f":"IF(ProjectData!E13=\"Single Strut (12G)\",Tables!G32,IF(ProjectData!E13=\"Double Strut (12G)\",Tables!G32,Tables!G23))","v":1288.58},{"$f":"IF(ProjectData!E13=\"Single Strut (12G)\",Tables!I32,IF(ProjectData!E13=\"Double Strut (12G)\",Tables!I32,Tables!I23))","v":7093.32}]
[null,null,null,null,null,null,null,null,null,null,"Delta",{"$f":"L128-L127","v":1251.3049999999998},{"$f":"M128-M127","v":6646.0199999999995}]
[null,null,null,null,null,null,null,null,null,null,"Notes:","Calculated lbs. Saved","Calculated Dollars Saved"]
[null,null,null,null,null,null,null,null,null,null,null,"Ref. Chart 4A","Ref. Chart 4B"]
[]
[]
[]
[]
[]
[]
[]
[]
[]
[null,null,null,null,null,null,null,null,null,null,"Tray Hardware","(QTY)","($ USD)"]
[null,null,null,null,null,null,null,null,null,null,"TSS:",{"$f":"IF(ProjectData!E13=\"Single Strut (12G)\",Tables!AH32+Tables!BT23,IF(ProjectData!E13=\"Double Strut (12G)\",Tables!AH32+Tables!BT23,Tables!AH23+Tables!BT23))","v":240},{"$f":"IF(ProjectData!E13=\"Single Strut (12G)\",Tables!AP32,IF(ProjectData!E13=\"Double Strut (12G)\",Tables!AP32,Tables!AP23))","v":630}]
[null,null,null,null,null,null,null,null,null,null,"NEMA:",{"$f":"IF(ProjectData!E13=\"Single Strut (12G)\",Tables!AG32+Tables!BS23,IF(ProjectData!E13=\"Double Strut (12G)\",Tables!AG32+Tables!BS23,Tables!AG23+Tables!BS23))","v":2071.9939999999997},{"$f":"IF(ProjectData!E13=\"Single Strut (12G)\",Tables!AO32,IF(ProjectData!E13=\"Double Strut (12G)\",Tables!AO32,Tables!AO23))","v":1805.9925000000001}]
[null,null,null,null,null,null,null,null,null,null,"Delta",{"$f":"L143-L142","v":1831.9939999999997},{"$f":"M143-M142","v":1175.9925000000001}]
[null,null,null,null,null,null,null,null,null,null,"Notes:","Calculated Pieces Saved","Calculated Dollars Saved"]
[null,null,null,null,null,null,null,null,null,null,null,"Ref. Chart 5A","Ref. Chart 5B"]
[]
[]
[]
[]
[null,null,null,null,null,null,null,null,null,null,"Tray Accessories","(QTY)","($ USD)"]
[null,null,null,null,null,null,null,null,null,null,"TSS:",{"$f":"IF(ProjectData!E13=\"Single Strut (12G)\",Tables!AB32+Tables!AD32+Tables!AF32+Tables!BR23,IF(ProjectData!E13=\"Double Strut (12G)\",Tables!AB32+Tables!AD32+Tables!AF32+Tables!BR23,Tables!AB23+Tables!AD23+Tables!AF23+Tables!BR23))","v":15},{"$f":"IF(ProjectData!E13=\"Single Strut (12G)\",Tables!AJ32+Tables!AL32+Tables!BR23,IF(ProjectData!E13=\"Double Strut (12G)\",Tables!AJ32+Tables!AL32+Tables!BR23,Tables!AJ23+Tables!AL23+Tables!BR24))","v":0}]
[null,null,null,null,null,null,null,null,null,null,"NEMA:",{"$f":"IF(ProjectData!E13=\"Single Strut (12G)\",Tables!AA32+Tables!AC32+Tables!AE32+Tables!BQ23,IF(ProjectData!E13=\"Double Strut (12G)\",Tables!AA32+Tables!AC32+Tables!AE32+Tables!BQ23,Tables!AA23+Tables!AC23+Tables!AE23+Tables!BQ23))","v":222.995},{"$f":"IF(ProjectData!E13=\"Single Strut (12G)\",Tables!AI32+Tables!AK32+Tables!BQ24,IF(ProjectData!E13=\"Double Strut (12G)\",Tables!AI32+Tables!AK32+Tables!BQ24,Tables!AI23+Tables!AK23+Tables!BQ24))","v":624.97499999999991}]
[null,null,null,null,null,null,null,null,null,null,"Delta",{"$f":"L153-L152","v":207.995},{"$f":"M153-M152","v":624.97499999999991}]
[null,null,null,null,null,null,null,null,null,null,"Notes:","Calculated Pieces Saved","Calculated Dollars Saved"]
[null,null,null,null,null,null,null,null,null,null,null,"Ref. Chart 6A","Ref. Chart 6B"]
[]
[]
[]
[null,null,null,null,null,null,null,null,null,null,"Structure Logistics","(Truck QTY)","($ USD)"]
[null,null,null,null,null,null,null,null,null,null,"TSS:",{"$f":"Tables!EJ22","v":3.0684999999999997E-2},{"$f":"Tables!EJ24","v":245.48}]
[null,null,null,null,null,null,null,null,null,null,"NEMA:",{"$f":"Tables!EJ21","v":6.4429E-2},{"$f":"Tables!EJ23","v":515.43200000000002}]
[null,null,null,null,null,null,null,null,null,null,"Delta",{"$f":"L162-L161","v":3.3744000000000003E-2},{"$f":"M162-M161","v":269.952}]
[null,null,null,null,null,null,null,null,null,null,"Notes:","Calculated Truck Volume Saved","Calculated Dollars Saved"]
[null,null,null,null,null,null,null,null,null,null,null,"Ref. Chart 7A","Ref. Chart 7B"]
[]
[]
[]
[]
[null,null,null,null,null,null,null,null,null,null,"Support Optimization","(QTY)","(Linear FT)"]
[null,null,null,null,null,null,null,null,null,null,"TSS:",{"$f":"IF(ProjectData!E13=\"Single Strut (12G)\",Tables!F32,IF(ProjectData!E13=\"Double Strut (12G)\",Tables!F32,Tables!F23))","v":71},{"$f":"IF(ProjectData!E13=\"Single Strut (12G)\",Tables!L32,IF(ProjectData!L13=\"Double Strut (12G)\",Tables!L32,Tables!L23))","v":161.5}]
[null,null,null,null,null,null,null,null,null,null,"NEMA:",{"$f":"IF(ProjectData!E13=\"Single Strut (12G)\",Tables!E32,IF(ProjectData!E13=\"Double Strut (12G)\",Tables!E32,Tables!E23))","v":119},{"$f":"IF(ProjectData!E13=\"Single Strut (12G)\",Tables!K32,IF(ProjectData!K13=\"Double Strut (12G)\",Tables!K32,Tables!K23))","v":339.1}]
[null,null,null,null,null,null,null,null,null,null,"Delta",{"$f":"L172-L171*-1","v":190},{"$f":"M172-M171","v":177.60000000000002}]
[null,null,null,null,null,null,null,null,null,null,"Notes:","Calculated Supports Saved","Calculated Linear FT Saved"]
[null,null,null,null,null,null,null,null,null,null,null,"Ref. Chart 8A","Ref. Chart 8B"]
[]
[]
[]
[]
[]
[]
[]
[]
[]
[]
[]
[]
[]
[]
[]
[]
[]
[]
[]
[]
[]
[]
[]
[]
[]
[]
[]
[]
[]
[]
[]
[]
[]
[]
[]
[]
[]
[]
[]
[]
[]
[]
[]
[]
[]
[]
[]
[]
[]
[]
[]
[]
[]
[]
[]
[]
[]
[]
[]
[]
[]
[]
[]
[]
[]
[]
[]
[]
[]
[]
[]
[]
[]
[]
[]
[]
[]
[]
[]
[]
[]
[]
[]
[]
[]
[]
[]
[]
[]
[]
[]
[]
[]
[]
[null,null,null,null,null,null,null,null,null,null,null,"Highlight Accessory Components","side by sid with light red X over NEMA"]
[null,null,null,null,null,null,null,null,null,null,null,"NEMA","TSS"]
[null,null,null,null,null,null,null,null,null,null,"Splice Plate","Splice Plate + Hardware","Pre Installed"]
[null,null,null,null,null,null,null,null,null,null,"Expansion","Expansion: Extra Cost","Expansion Ready"]
[null,null,null,null,null,null,null,null,null,null,"Flexability: Cable Drop","Modify Tray (Not UL)","Move Rung"]
[null,null,null,null,null,null,null,null,null,null,"Site Modify","Can't","Rungs / Fittings = no hot work"]
[null,null,null,null,null,null,null,null,null,null,"Conectivity","Can't","Continious Strut Connections"]
[null,null,null,null,null,null,null,null,null,null,"Fitting Strength","None - often fails","Reinforced Midpoints & Ends"]
[null,null,null,null,null,null,null,null,null,null,"Prefabrication","Heavy Skilled Labor Required","Designed to easily expedite Prefab"]
[null,null,null,null,null,null,null,null,null,null,"Modular Design","Static NEMA VE2 Offering","Modular Splice designed for strength & forgiveness"]
[null,null,null,null,null,null,null,null,null,null,"Covers","Expesive clamps that often Sag","Inexpensive 316 screws that hold tight and install quickly"]
[null,null,null,null,null,null,null,null,null,null,"Reducers","Expensive Fixed Fittings","Inexpensive Plates that lock firm and install quickly"]
[null,null,null,null,null,null,null,null,null,null,"Rung Safety","Optimized for manfacturer Cost savings (200lbs)","Optimized for customer savings (350lbs)"]
[null,null,null,null,null,null,null,null,null,null,"Tray Safety","Optimized for manfacturer Cost savings (250lbs pull out)","Optimized for customer savings (1100lb pull out)"]
[]
[]
[]
[]
[]
[]
[]
[]
[]
[]
[]
[]
[]
[]
[]
[]
[]
[]
[]
[]
[]
[]
[]
[]
[]
[]
[]
[]
[]
[]
[]
[]
[null,null,null,null,null,null,null,null,null,null,null,{"$f":"IFERROR(\"Maximize project returns by eliminating structure, increasing installation efficiency, and removing complexitity. By applying TSS advantages, your next project could yeild $\"&TEXT(K75,\"#,###\")&\" or more in project savings. Bonus: Savings do not account for Civil Piling\",\"Please enter values for all of the inputs to view the completed analysis.\")","v":"Maximize project returns by eliminating structure, increasing installation efficiency, and removing complexitity. By applying TSS advantages, your next project could yeild $11,488 or more in project savings. Bonus: Savings do not account for Civil Piling"}]
[]
[]
[]
[null,null,null,null,null,null,null,null,null,null,null,{"$f":"IFERROR(\"Exceed project schedules by decreasing critical path & skilled labor hours.  With intuitive design and simplicstic fixing methods, more than \"&TEXT(K55,\"#,###0.0\")&\" hours can be eliminated.\",\"Please enter values for all of the inputs to view the completed analysis.\")","v":"Exceed project schedules by decreasing critical path & skilled labor hours.  With intuitive design and simplicstic fixing methods, more than 34.6 hours can be eliminated."}]
[]
[]
[]
[null,null,null,null,null,null,null,null,null,null,null,{"$f":"IFERROR(\"Errors and unwanted expenses often stem from jobsite complexities.  CTI's TOUGHTray system can eliminate as much as \"&TEXT(K64,\"#,###\")&\" pieces of hardware and accessores from this project.\",\"Please enter values for all of the inputs to view the completed analysis.\")","v":"Errors and unwanted expenses often stem from jobsite complexities.  CTI's TOUGHTray system can eliminate as much as 2,230 pieces of hardware and accessores from this project."}]
[]
[]
[]
[null,null,null,null,null,null,null,null,null,null,null,"With modularity and site adaptivity on full display making it ideal for prefabrication and tight schedules"]
[]
[]
[null,null,null,null,null,null,null,null,null,null,null,{"$f":"IFERROR(\"A typical NEMA installation of this size would require a \"&TEXT(M32,\"#,##0.0%\")&\" reduction in material prices to meet the $ value of TSS while still requiring an extra \"&TEXT(K55,\"#,##0.0\")&\" hours of additional labor.\",\"Please enter values for all of the inputs to view the completed analysis.\")","v":"A typical NEMA installation of this size would require a 55.5% reduction in material prices to meet the $ value of TSS while still requiring an extra 34.6 hours of additional labor."}]
[]
[]
[]
[null,null,null,null,null,null,null,null,null,null,null,{"$f":"\"TOUGH Support Savings:\n(The ability to minimize project expenses and maximize project ROI):\"","v":"TOUGH Support Savings:\n(The ability to minimize project expenses and maximize project ROI):"}]
[]
[]
[]
[null,null,null,null,null,null,null,null,null,null,null,{"$f":"\"1. Support Optimization - Eliminate Unnecessary Tray Supports\n2. Field Adaptability - Simplify & Speed Up Tray Installation\n3. Modular Assembly - Reduce Complexity with Interchangeable Components\"","v":"1. Support Optimization - Eliminate Unnecessary Tray Supports\n2. Field Adaptability - Simplify & Speed Up Tray Installation\n3. Modular Assembly - Reduce Complexity with Interchangeable Components"}]
[]
[]
[]
[]
[null,null,null,null,null,null,null,null,null,null,null,{"$f":"\"Material savings based on conservative industry rates: \nStuctural Raw Material $\"&TEXT('CTI Input Sheet'!B28,\"#,###.00\")&\"/hr \nMaterial Fabrication: $\" &TEXT('CTI Input Sheet'!B28,\"#,###.00\")&\"/hr \"","v":"Material savings based on conservative industry rates: \nStuctural Raw Material $1.50/hr \nMaterial Fabrication: $1.50/hr "}]
[]
[]
[]
[null,null,null,null,null,null,null,null,null,null,null,{"$f":"IFERROR(\"Labor savings based on customer Inputs: \nTray Installer: $\"&TEXT(ProjectData!C14,\"#,###\")&\"/hr \nStructural Erector $\" &TEXT(ProjectData!C15,\"#,###\")&\"/hr \nDesign Engineer $\" &TEXT(ProjectData!C16,\"#,###\")&\"/hr\",\"Please enter values for all of the inputs to view the completed analysis.\")","v":"Labor savings based on customer Inputs: \nTray Installer: $75/hr \nStructural Erector $75/hr \nDesign Engineer $75/hr"}]

{"sheet":"DropDowns","index":2,"n_rows":9,"n_cols":6,"rows_kept":9,"cut":false,"hidden":true,"merged":[]}
["Cable Tray Support Structural Sections","Cable Tray Accessory Costs (USD)","Handling","Cover Selection","Project Stage","Finish"]
["Single Strut (12G)","Hold Down Clamps (PR)","30ft Hot Shot","Not Required","FEED","Pre-Galv"]
["Double Strut (12G)","Clamp Hardware  (PR)","40ft Flat Bed","Required","Project Bid","HotDip Galv"]
["C-Channel (C6x13)","Expansion Guides (PR)","40ft Container",null,"Installation","Stainless"]
["I-Beam (S8x23)","Guide Hardware (PR)",null,null,null,"Painted"]
["I-Beam (S12x50)","4\" Expansion Splice Plate (PR)"]
[null,"6\" Expansion Splice Plate (PR)"]
[null,"4\" Expansion Cartridge (PR)"]
[null,"6\" Expansion Cartridge (PR)"]

{"sheet":"Tables","index":3,"n_rows":93,"n_cols":141,"rows_kept":93,"cut":false,"hidden":true,"merged":[[19,34,19,41],[20,34,20,35],[20,36,20,37],[20,38,20,39],[20,40,20,41],[33,2,34,2],[28,1,34,1],[19,1,25,1],[28,2,31,2],[28,4,28,11],[28,13,28,18],[28,26,28,33],[29,4,29,5],[29,6,29,7],[29,8,29,9],[29,10,29,11],[29,13,29,14],[29,15,29,16],[29,17,29,18],[29,26,29,27],[29,28,29,29],[29,30,29,31],[20,26,20,27],[20,28,20,29],[20,30,20,31],[20,32,20,33],[2,23,2,24],[2,21,2,22],[2,19,2,20],[19,19,19,24],[20,19,20,20],[20,21,20,22],[20,23,20,24],[19,4,19,11],[20,10,20,11],[37,10,37,11],[19,2,22,2],[19,13,19,18],[20,13,20,14],[20,15,20,16],[20,17,20,18],[1,1,1,2],[35,4,35,7],[2,2,3,2],[2,1,3,1],[2,13,2,14],[2,15,2,16],[2,17,2,18],[1,13,1,18],[2,4,2,5],[2,6,2,7],[2,8,2,9],[1,4,1,11],[2,10,2,11],[47,4,47,27],[29,32,29,33],[28,34,28,41],[29,34,29,35],[29,36,29,37],[37,29,37,30],[37,31,37,32],[36,29,36,32],[24,2,25,2],[28,19,28,24],[29,19,29,20],[29,21,29,22],[29,23,29,24],[29,38,29,39],[29,40,29,41],[48,22,48,23],[19,42,19,47],[20,42,20,43],[20,44,20,45],[20,46,20,47],[19,26,19,33],[50,1,55,1],[39,1,44,1],[37,26,38,27],[39,26,39,27],[40,26,40,27],[41,26,41,27],[42,26,42,27],[43,26,43,27],[44,26,44,27],[48,26,49,27],[50,26,50,27],[51,26,51,27],[52,26,52,27],[53,26,53,27],[54,26,54,27],[55,26,55,27],[48,2,49,2],[47,1,47,2],[48,24,48,25],[48,1,49,1],[36,1,36,2],[37,1,38,1],[37,2,38,2],[36,4,36,27],[37,4,37,5],[37,6,37,7],[37,8,37,9],[37,12,37,13],[37,14,37,15],[37,16,37,17],[37,18,37,19],[37,20,37,21],[37,22,37,23],[37,24,37,25],[48,4,48,5],[48,6,48,7],[48,8,48,9],[48,12,48,13],[48,14,48,15],[48,16,48,17],[48,18,48,19],[48,20,48,21],[10,85,10,86],[10,87,10,88],[10,89,10,90],[9,77,9,90],[20,79,20,80],[20,81,20,82],[20,83,20,84],[20,85,20,86],[19,77,19,90],[20,87,20,88],[20,89,20,90],[10,81,10,82],[10,83,10,84],[20,58,20,59],[20,77,20,78],[19,92,19,111],[20,92,20,93],[20,94,20,95],[20,96,20,97],[20,98,20,99],[20,100,20,101],[20,102,20,103],[20,104,20,105],[20,106,20,107],[20,108,20,109],[20,110,20,111],[19,64,19,75],[20,64,20,65],[20,68,20,69],[20,70,20,71],[20,72,20,73],[20,74,20,75],[19,58,19,59],[19,61,19,62],[20,61,20,62],[0,42,0,47],[1,44,1,45],[1,46,1,47],[1,58,1,59],[2,61,2,62],[2,58,2,59],[2,30,2,31],[2,28,2,29],[2,26,2,27],[1,61,1,62],[1,26,1,33],[2,32,2,33],[1,42,1,43],[2,72,2,73],[2,74,2,75],[2,66,2,67],[20,66,20,67],[1,113,1,122],[19,113,19,122],[20,113,20,114],[20,115,20,116],[20,117,20,118],[20,119,20,120],[20,121,20,122],[1,92,1,111],[2,92,2,93],[2,94,2,95],[2,96,2,97],[2,98,2,99],[2,100,2,101],[2,102,2,103],[2,104,2,105],[2,106,2,107],[2,108,2,109],[2,110,2,111],[10,77,10,78],[10,79,10,80],[28,42,28,47],[29,42,29,43],[29,44,29,45],[29,46,29,47],[20,4,20,5],[20,6,20,7],[20,8,20,9],[1,64,1,75],[19,131,19,136],[20,131,20,132],[20,133,20,134],[20,135,20,136],[20,124,20,125],[20,126,20,127],[20,128,20,129],[19,124,19,129],[2,113,2,114],[2,115,2,116],[2,117,2,118],[2,119,2,120],[2,121,2,122],[2,64,2,65],[2,68,2,69],[2,70,2,71]]}
[null,null,null,null,null,null,null,null,null,null,null,null,null,null,null,null,null,null,null,null,null,null,null,null,null,null,null,null,null,null,null,null,null,null,null,null,null,null,null,null,null,null,"TRAY ACCESSORY INSTALLATION TIME (HRS)",null,null,null,null,null,null,null,null,null,null,null,null,null,null,null,null,null,null,null,null,null,null,null,null,null,null,null,null,null,null,null,null,null,null,null,null,null,null,null,"Chart or special Note (index match based on input selection) Summary Sheet",null,null,null,null,null,null,null,null,null,null,null,null,null,null,null,null,null,null,null,null,"Chart or special Note (index match based on input selection) Summary Sheet"]
[null,"CABLE TRAY BOM",null,null,"STRUCTURE",null,null,null,null,null,null,null,null,"SKILLED LABOR",null,null,null,null,null,null,null,null,null,null,null,null,"TRAY ACCESSORY QUANTITY",null,null,null,null,null,null,null,null,null,null,null,null,null,null,null,"Clamp Installation Time (HRS)",null,"Guide Installation Time (HRS)",null,"Splice/Link Installation Time (HRS)",null,null,null,null,null,null,null,null,null,null,null,"TOTAL TRAY INSTALLATION TIME (HRS)",null,null,"TOTAL TRAY INSTALLATION COST (USD)",null,null,"COVERS & COVER CLAMPS",null,null,null,null,null,null,null,null,null,null,null,null,null,null,null,null,null,null,null,null,null,null,null,null,null,null,null,"STRUT TRAPEZE SUPPORT : SUPPORT QUANTITIES - WEIGHT - TIME - COSTS ",null,null,null,null,null,null,null,null,null,null,null,null,null,null,null,null,null,null,null,null,"STRUT TRAPEZE SUPPORT : TRAY CLAMPS & GUIDES "]
[null,"Tray Item Type","Total Quantity",null,"Support Quantity (PCS)",null,"Support Weight (LBS)",null,"Support Cost (USD)",null,"Support Linear Length (FT)",null,null,"Structural Engineer Time",null,"Steel Erector Time",null,"Tray Installer Time",null,"Structural Design Cost",null,"Structure Cost",null,"Tray Installer Cost",null,null,"Clamp Quantity",null,"Guide Quantity",null,"Splice Quantity",null,"Hardware Quantity",null,null,null,null,null,null,null,null,null,"NEMA","TSS","NEMA","TSS","NEMA","TSS",null,null,null,null,null,null,null,null,null,null,"All Tray Accessory Items",null,null,"All Tray Accessory Items",null,null,"COVER WEIGHT (lbs)",null,"COVER CLAMP WEIGHT (lbs)",null,"COVER CLAMP QTY (ea)",null,"HARDWARE QTY (pcs)",null,"INSTALLATION TIME (hrs)",null,"INSTALLATION COST (usd)",null,null,null,null,null,null,null,null,null,null,null,null,null,null,null,null,null,"STRUT QUANTITY (FT)",null,"ATR QUANTITY (FT)",null,"FITTINGS QUANTITY (PCS)",null,"HDWR QUANTITY (PCS)",null,"STRUT WEIGHT (LBS)",null,"ATR WEIGHT (LBS)",null,"STRUT COST (USD)",null,"ATR COST (USD)",null,"INSTALLATION TIME (HRS)",null,"INSTALLATION COST (USD)",null,null,"CLAMP QUANTITY (PRS)",null,"GUIDE QUANTITY (PRS)",null,"HDWR QUANTITY (PCS)",null,"INSTALLATION TIME (HRS)",null,"INSTALLATION COST (USD)"]
[null,null,null,null,"NEMA","TSS","NEMA","TSS","NEMA","TSS","NEMA","TSS","Tray Item Type","NEMA","TSS","NEMA","TSS","NEMA","TSS","NEMA","TSS","NEMA","TSS","NEMA","TSS",null,"NEMA","TSS","NEMA","TSS","NEMA","TSS","NEMA","TSS",null,null,null,null,null,null,null,null,null,null,null,null,null,null,null,null,null,null,null,null,null,null,null,null,"NEMA","TSS",null,"NEMA","TSS",null,"NEMA","TSS","NEMA","TSS","NEMA","TSS","NEMA","TSS","NEMA","TSS","NEMA","TSS",null,null,null,null,null,null,null,null,null,null,null,null,null,null,null,null,"NEMA","TSS","NEMA","TSS","NEMA","TSS","NEMA","TSS","NEMA","TSS","NEMA","TSS","NEMA","TSS","NEMA","TSS","NEMA","TSS","NEMA","TSS",null,"NEMA","TSS","NEMA","TSS","NEMA","TSS","NEMA","TSS","NEMA","TSS"]
[null,null,null,null,null,null,null,null,null,null,null,null,null,null,null,null,null,null,null,null,null,null,null,null,null,null,null,null,null,null,null,null,null,null,null,null,null,null,null,null,null,null,{"$f":"'VE2'!AL24","v":0},{"$f":"TSS!AL24","v":0},{"$f":"'VE2'!AM24","v":0},{"$f":"TSS!AM24","v":0},{"$f":"'VE2'!AK24","v":0},{"$f":"TSS!AK24","v":0}]
[null,"12ft Straight Sections",{"$f":"'VE2'!B24","v":0},null,{"$f":"'VE2'!T24","v":0},{"$f":"TSS!T24","v":0},{"$f":"'VE2'!U24","v":0},{"$f":"TSS!U24","v":0},{"$f":"'VE2'!V24","v":0},{"$f":"TSS!V24","v":0},{"$f":"'VE2'!G24","v":0},{"$f":"TSS!G24","v":0},"12ft Straight Sections",{"$f":"'VE2'!W24","v":0},{"$f":"TSS!W24","v":0},{"$f":"'VE2'!X24","v":0},{"$f":"TSS!X24","v":0},{"$f":"'VE2'!AN24","v":0},{"$f":"TSS!AN24","v":0},{"$f":"N6*ProjectData!$C$16","v":0},{"$f":"O6*ProjectData!$C$16","v":0},{"$f":"P6*ProjectData!$C$15","v":0},{"$f":"Q6*ProjectData!$C$15","v":0},{"$f":"R6*ProjectData!$C$14","v":0},{"$f":"S6*ProjectData!$C$14","v":0},null,{"$f":"'VE2'!AB24","v":0},{"$f":"TSS!AB24","v":0},{"$f":"'VE2'!AD24","v":0},{"$f":"TSS!AD24","v":0},{"$f":"'VE2'!Z24","v":0},{"$f":"TSS!Z24","v":0},{"$f":"'VE2'!G262","v":0},{"$f":"TSS!G262","v":0},null,null,null,null,null,null,null,null,{"$f":"'VE2'!AL35","v":0.49995000000000001},{"$f":"TSS!AL35","v":0.53333333333333333},{"$f":"'VE2'!AM35","v":1.16655},{"$f":"TSS!AM35","v":1.2000000000000002},{"$f":"'VE2'!AK35","v":3.75},{"$f":"TSS!AK35","v":0.75},null,null,null,null,null,null,null,null,null,null,{"$f":"'VE2'!H262","v":0},{"$f":"TSS!H262","v":0},null,{"$f":"'VE2'!I262","v":0},{"$f":"TSS!I262","v":0},null,{"$f":"'VE2'!O262","v":0},{"$f":"TSS!O262","v":0},{"$f":"'VE2'!P262","v":0},{"$f":"TSS!P262","v":0},{"$f":"'VE2'!M262","v":0},{"$f":"TSS!M262","v":0},{"$f":"'VE2'!N262","v":0},{"$f":"TSS!N262","v":0},{"$f":"'VE2'!R262","v":0},{"$f":"TSS!R262","v":0},{"$f":"'VE2'!T262","v":0},{"$f":"TSS!T262","v":0},null,null,null,null,null,null,null,null,null,null,null,null,null,null,null,null,{"$f":"'VE2'!D281","v":0},{"$f":"TSS!D281","v":0},{"$f":"'VE2'!E281","v":0},{"$f":"TSS!E281","v":0},{"$f":"'VE2'!F281","v":0},{"$f":"TSS!F281","v":0},{"$f":"'VE2'!G281","v":0},{"$f":"TSS!G281","v":0},{"$f":"'VE2'!D300","v":0},{"$f":"TSS!D300","v":0},{"$f":"'VE2'!F300","v":0},{"$f":"TSS!F300","v":0},{"$f":"'VE2'!H300","v":0},{"$f":"TSS!H300","v":0},{"$f":"'VE2'!I300","v":0},{"$f":"TSS!I300","v":0},{"$f":"'VE2'!H281","v":0},{"$f":"TSS!H281","v":0},{"$f":"'VE2'!I281","v":0},{"$f":"TSS!I281","v":0},null,{"$f":"'VE2'!D319","v":0},{"$f":"TSS!D319","v":0},{"$f":"'VE2'!E319","v":0},{"$f":"TSS!E319","v":0},{"$f":"'VE2'!F319","v":0},{"$f":"TSS!F319","v":0},{"$f":"'VE2'!G319","v":0},{"$f":"TSS!G319","v":0},{"$f":"'VE2'!H319","v":0},{"$f":"TSS!H319","v":0}]
[null,"20ft Straight Sections",{"$f":"'VE2'!B35","v":45},null,{"$f":"'VE2'!T35","v":45},{"$f":"TSS!T35","v":45},{"$f":"'VE2'!U35","v":370.5},{"$f":"TSS!U35","v":370.5},{"$f":"'VE2'!V35","v":2871.375},{"$f":"TSS!V35","v":2871.375},{"$f":"'VE2'!G35","v":97.5},{"$f":"TSS!G35","v":97.5},"20ft Straight Sections",{"$f":"'VE2'!W35","v":11.25},{"$f":"TSS!W35","v":11.25},{"$f":"'VE2'!X35","v":11.25},{"$f":"TSS!X35","v":11.25},{"$f":"'VE2'!AN35","v":5.4164999999999992},{"$f":"TSS!AN35","v":2.4833333333333334},{"$f":"N7*ProjectData!$C$16","v":843.75},{"$f":"O7*ProjectData!$C$16","v":843.75},{"$f":"P7*ProjectData!$C$15","v":843.75},{"$f":"Q7*ProjectData!$C$15","v":843.75},{"$f":"R7*ProjectData!$C$14","v":406.23749999999995},{"$f":"S7*ProjectData!$C$14","v":186.25},null,{"$f":"'VE2'!AB35","v":14.998499999999998},{"$f":"TSS!AB35","v":16},{"$f":"'VE2'!AD35","v":34.996499999999997},{"$f":"TSS!AD35","v":36},{"$f":"'VE2'!Z35","v":45},{"$f":"TSS!Z35","v":0},{"$f":"'VE2'!G263","v":923.99400000000003},{"$f":"TSS!G263","v":568},null,null,null,null,null,null,null,null,{"$f":"'VE2'!AL60","v":0.4},{"$f":"TSS!AL60","v":0.26666666666666666},{"$f":"'VE2'!AM60","v":0},{"$f":"TSS!AM60","v":0},{"$f":"'VE2'!AK60","v":0.66666666666666663},{"$f":"TSS!AK60","v":0.13333333333333333},null,null,null,null,null,null,null,null,null,null,{"$f":"'VE2'!H263","v":5.4164999999999992},{"$f":"TSS!H263","v":2.4833333333333334},null,{"$f":"'VE2'!I263","v":406.23749999999995},{"$f":"TSS!I263","v":186.25},null,{"$f":"'VE2'!O263","v":0},{"$f":"TSS!O263","v":0},{"$f":"'VE2'!P263","v":0},{"$f":"TSS!P263","v":0},{"$f":"'VE2'!M263","v":0},{"$f":"TSS!M263","v":0},{"$f":"'VE2'!N263","v":0},{"$f":"TSS!N263","v":0},{"$f":"'VE2'!R263","v":0},{"$f":"TSS!R263","v":0},{"$f":"'VE2'!T263","v":0},{"$f":"TSS!T263","v":0},null,null,null,null,null,null,null,null,null,null,null,null,null,null,null,null,{"$f":"'VE2'!D282","v":97.5},{"$f":"TSS!D282","v":0},{"$f":"'VE2'!E282","v":180},{"$f":"TSS!E282","v":112.5},{"$f":"'VE2'!F282","v":180},{"$f":"TSS!F282","v":90},{"$f":"'VE2'!G282","v":180},{"$f":"TSS!G282","v":360},{"$f":"'VE2'!D301","v":370.5},{"$f":"TSS!D301","v":0},{"$f":"'VE2'!F301","v":37.799999999999997},{"$f":"TSS!F301","v":23.625},{"$f":"'VE2'!H301","v":2223},{"$f":"TSS!H301","v":0},{"$f":"'VE2'!I301","v":453.6},{"$f":"TSS!I301","v":283.5},{"$f":"'VE2'!H282","v":5.25},{"$f":"TSS!H282","v":1.5},{"$f":"'VE2'!I282","v":393.75},{"$f":"TSS!I282","v":112.5},null,{"$f":"'VE2'!D320","v":14.998499999999998},{"$f":"TSS!D320","v":0},{"$f":"'VE2'!E320","v":34.996499999999997},{"$f":"TSS!E320","v":0},{"$f":"'VE2'!F320","v":203.994},{"$f":"TSS!F320","v":0},{"$f":"'VE2'!G320","v":2.7775000000000001E-2},{"$f":"TSS!G320","v":0},{"$f":"'VE2'!H320","v":2.0831249999999999},{"$f":"TSS!H320","v":0}]
[null,"Horizontal Elbow",{"$f":"'VE2'!B60","v":4},null,{"$f":"'VE2'!T60","v":12},{"$f":"TSS!T60","v":8},{"$f":"'VE2'!U60","v":129.19999999999999},{"$f":"TSS!U60","v":76},{"$f":"'VE2'!V60","v":1001.3000000000001},{"$f":"TSS!V60","v":589},{"$f":"'VE2'!J60","v":34},{"$f":"TSS!J60","v":20},"Horizontal Elbow",{"$f":"'VE2'!W60","v":18},{"$f":"TSS!W60","v":12},{"$f":"'VE2'!X60","v":3},{"$f":"TSS!X60","v":2},{"$f":"'VE2'!AN60","v":1.0666666666666667},{"$f":"TSS!AN60","v":0.4},{"$f":"N8*ProjectData!$C$16","v":1350},{"$f":"O8*ProjectData!$C$16","v":900},{"$f":"P8*ProjectData!$C$15","v":225},{"$f":"Q8*ProjectData!$C$15","v":150},{"$f":"R8*ProjectData!$C$14","v":80},{"$f":"S8*ProjectData!$C$14","v":30},null,{"$f":"'VE2'!AB60","v":12},{"$f":"TSS!AB60","v":8},{"$f":"'VE2'!AD60","v":0},{"$f":"TSS!AD60","v":0},{"$f":"'VE2'!Z60","v":8},{"$f":"TSS!Z60","v":0},{"$f":"'VE2'!G264","v":176},{"$f":"TSS!G264","v":32},null,null,null,null,null,null,null,null,{"$f":"'VE2'!AL85","v":0.3},{"$f":"TSS!AL85","v":0.2},{"$f":"'VE2'!AM85","v":0},{"$f":"TSS!AM85","v":0},{"$f":"'VE2'!AK85","v":0.5},{"$f":"TSS!AK85","v":0.1},null,null,null,null,null,null,null,null,null,null,{"$f":"'VE2'!H264","v":1.0666666666666667},{"$f":"TSS!H264","v":0.4},null,{"$f":"'VE2'!I264","v":80},{"$f":"TSS!I264","v":30.000000000000004},null,{"$f":"'VE2'!O264","v":0},{"$f":"TSS!O264","v":0},{"$f":"'VE2'!P264","v":0},{"$f":"TSS!P264","v":0},{"$f":"'VE2'!M264","v":0},{"$f":"TSS!M264","v":0},{"$f":"'VE2'!N264","v":0},{"$f":"TSS!N264","v":0},{"$f":"'VE2'!R264","v":0},{"$f":"TSS!R264","v":0},{"$f":"'VE2'!T264","v":0},{"$f":"TSS!T264","v":0},null,null,null,null,null,null,null,null,null,null,null,null,null,null,null,null,{"$f":"'VE2'!D283","v":24},{"$f":"TSS!D283","v":0},{"$f":"'VE2'!E283","v":48},{"$f":"TSS!E283","v":20},{"$f":"'VE2'!F283","v":48},{"$f":"TSS!F283","v":16},{"$f":"'VE2'!G283","v":48},{"$f":"TSS!G283","v":64},{"$f":"'VE2'!D302","v":91.199999999999989},{"$f":"TSS!D302","v":0},{"$f":"'VE2'!F302","v":10.08},{"$f":"TSS!F302","v":4.2},{"$f":"'VE2'!H302","v":547.20000000000005},{"$f":"TSS!H302","v":0},{"$f":"'VE2'!I302","v":120.96000000000001},{"$f":"TSS!I302","v":50.4},{"$f":"'VE2'!H283","v":1.4},{"$f":"TSS!H283","v":0.26666666666666666},{"$f":"'VE2'!I283","v":105},{"$f":"TSS!I283","v":20},null,{"$f":"'VE2'!D321","v":12},{"$f":"TSS!D321","v":0},{"$f":"'VE2'!E321","v":0},{"$f":"TSS!E321","v":0},{"$f":"'VE2'!F321","v":48},{"$f":"TSS!F321","v":0},{"$f":"'VE2'!G321","v":6.6666666666666671E-3},{"$f":"TSS!G321","v":0},{"$f":"'VE2'!H321","v":0.5},{"$f":"TSS!H321","v":0}]
[null,"Horizontal Tee",{"$f":"'VE2'!B85","v":2},null,{"$f":"'VE2'!T85","v":8},{"$f":"TSS!T85","v":6},{"$f":"'VE2'!U85","v":110.19999999999999},{"$f":"TSS!U85","v":68.399999999999991},{"$f":"'VE2'!V85","v":854.05000000000007},{"$f":"TSS!V85","v":530.09999999999991},{"$f":"'VE2'!K85","v":29},{"$f":"TSS!K85","v":18},"Horizontal Tee",{"$f":"'VE2'!W85","v":20},{"$f":"TSS!W85","v":15},{"$f":"'VE2'!X85","v":2},{"$f":"TSS!X85","v":1.5},{"$f":"'VE2'!AN85","v":0.8},{"$f":"TSS!AN85","v":0.30000000000000004},{"$f":"N9*ProjectData!$C$16","v":1500},{"$f":"O9*ProjectData!$C$16","v":1125},{"$f":"P9*ProjectData!$C$15","v":150},{"$f":"Q9*ProjectData!$C$15","v":112.5},{"$f":"R9*ProjectData!$C$14","v":60},{"$f":"S9*ProjectData!$C$14","v":22.500000000000004},null,{"$f":"'VE2'!AB85","v":9},{"$f":"TSS!AB85","v":6},{"$f":"'VE2'!AD85","v":0},{"$f":"TSS!AD85","v":0},{"$f":"'VE2'!Z85","v":6},{"$f":"TSS!Z85","v":0},{"$f":"'VE2'!G265","v":132},{"$f":"TSS!G265","v":24},null,null,null,null,null,null,null,null,{"$f":"'VE2'!AL110","v":0},{"$f":"TSS!AL110","v":0},{"$f":"'VE2'!AM110","v":0},{"$f":"TSS!AM110","v":0},{"$f":"'VE2'!AK110","v":0},{"$f":"TSS!AK110","v":0},null,null,null,null,null,null,null,null,null,null,{"$f":"'VE2'!H265","v":0.8},{"$f":"TSS!H265","v":0.30000000000000004},null,{"$f":"'VE2'!I265","v":60},{"$f":"TSS!I265","v":22.500000000000004},null,{"$f":"'VE2'!O265","v":0},{"$f":"TSS!O265","v":0},{"$f":"'VE2'!P265","v":0},{"$f":"TSS!P265","v":0},{"$f":"'VE2'!M265","v":0},{"$f":"TSS!M265","v":0},{"$f":"'VE2'!N265","v":0},{"$f":"TSS!N265","v":0},{"$f":"'VE2'!R265","v":0},{"$f":"TSS!R265","v":0},{"$f":"'VE2'!T265","v":0},{"$f":"TSS!T265","v":0},null,"Chart",null,null,null,null,null,null,null,null,null,null,null,null,null,null,{"$f":"'VE2'!D284","v":20},{"$f":"TSS!D284","v":0},{"$f":"'VE2'!E284","v":32},{"$f":"TSS!E284","v":15},{"$f":"'VE2'!F284","v":32},{"$f":"TSS!F284","v":12},{"$f":"'VE2'!G284","v":32},{"$f":"TSS!G284","v":48},{"$f":"'VE2'!D303","v":76},{"$f":"TSS!D303","v":0},{"$f":"'VE2'!F303","v":6.72},{"$f":"TSS!F303","v":3.15},{"$f":"'VE2'!H303","v":456},{"$f":"TSS!H303","v":0},{"$f":"'VE2'!I303","v":80.64},{"$f":"TSS!I303","v":37.799999999999997},{"$f":"'VE2'!H284","v":0.93333333333333335},{"$f":"TSS!H284","v":0.2},{"$f":"'VE2'!I284","v":70},{"$f":"TSS!I284","v":15},null,{"$f":"'VE2'!D322","v":9},{"$f":"TSS!D322","v":0},{"$f":"'VE2'!E322","v":0},{"$f":"TSS!E322","v":0},{"$f":"'VE2'!F322","v":36},{"$f":"TSS!F322","v":0},{"$f":"'VE2'!G322","v":5.0000000000000001E-3},{"$f":"TSS!G322","v":0},{"$f":"'VE2'!H322","v":0.375},{"$f":"TSS!H322","v":0}]
[null,"Horizontal Cross",{"$f":"'VE2'!B110","v":0},null,{"$f":"'VE2'!T110","v":0},{"$f":"TSS!T110","v":0},{"$f":"'VE2'!U110","v":0},{"$f":"TSS!U110","v":0},{"$f":"'VE2'!V110","v":0},{"$f":"TSS!V110","v":0},{"$f":"'VE2'!L110","v":0},{"$f":"TSS!L110","v":0},"Horizontal Cross",{"$f":"'VE2'!W110","v":0},{"$f":"TSS!W110","v":0},{"$f":"'VE2'!X110","v":0},{"$f":"TSS!X110","v":0},{"$f":"'VE2'!AN110","v":0},{"$f":"TSS!AN110","v":0},{"$f":"N10*ProjectData!$C$16","v":0},{"$f":"O10*ProjectData!$C$16","v":0},{"$f":"P10*ProjectData!$C$15","v":0},{"$f":"Q10*ProjectData!$C$15","v":0},{"$f":"R10*ProjectData!$C$14","v":0},{"$f":"S10*ProjectData!$C$14","v":0},null,{"$f":"'VE2'!AB110","v":0},{"$f":"TSS!AB110","v":0},{"$f":"'VE2'!AD110","v":0},{"$f":"TSS!AD110","v":0},{"$f":"'VE2'!Z110","v":0},{"$f":"TSS!Z110","v":0},{"$f":"'VE2'!G266","v":0},{"$f":"TSS!G266","v":0},null,null,null,null,null,null,null,null,{"$f":"'VE2'!AL135","v":0.4},{"$f":"TSS!AL135","v":0.2},{"$f":"'VE2'!AM135","v":0},{"$f":"TSS!AM135","v":0},{"$f":"'VE2'!AK135","v":1},{"$f":"TSS!AK135","v":0.2},null,null,null,null,null,null,null,null,null,null,{"$f":"'VE2'!H266","v":0},{"$f":"TSS!H266","v":0},null,{"$f":"'VE2'!I266","v":0},{"$f":"TSS!I266","v":0},null,{"$f":"'VE2'!O266","v":0},{"$f":"TSS!O266","v":0},{"$f":"'VE2'!P266","v":0},{"$f":"TSS!P266","v":0},{"$f":"'VE2'!M266","v":0},{"$f":"TSS!M266","v":0},{"$f":"'VE2'!N266","v":0},{"$f":"TSS!N266","v":0},{"$f":"'VE2'!R266","v":0},{"$f":"TSS!R266","v":0},{"$f":"'VE2'!T266","v":0},{"$f":"TSS!T266","v":0},null,"HADJ & VADJ ADJUSTABLE SPLICES",null,null,null,null,null,null,null,null,null,null,null,null,null,null,{"$f":"'VE2'!D285","v":0},{"$f":"TSS!D285","v":0},{"$f":"'VE2'!E285","v":0},{"$f":"TSS!E285","v":0},{"$f":"'VE2'!F285","v":0},{"$f":"TSS!F285","v":0},{"$f":"'VE2'!G285","v":0},{"$f":"TSS!G285","v":0},{"$f":"'VE2'!D304","v":0},{"$f":"TSS!D304","v":0},{"$f":"'VE2'!F304","v":0},{"$f":"TSS!F304","v":0},{"$f":"'VE2'!H304","v":0},{"$f":"TSS!H304","v":0},{"$f":"'VE2'!I304","v":0},{"$f":"TSS!I304","v":0},{"$f":"'VE2'!H285","v":0},{"$f":"TSS!H285","v":0},{"$f":"'VE2'!I285","v":0},{"$f":"TSS!I285","v":0},null,{"$f":"'VE2'!D323","v":0},{"$f":"TSS!D323","v":0},{"$f":"'VE2'!E323","v":0},{"$f":"TSS!E323","v":0},{"$f":"'VE2'!F323","v":0},{"$f":"TSS!F323","v":0},{"$f":"'VE2'!G323","v":0},{"$f":"TSS!G323","v":0},{"$f":"'VE2'!H323","v":0},{"$f":"TSS!H323","v":0}]
[null,"Vertical Inside Elbow",{"$f":"'VE2'!B135","v":6},null,{"$f":"'VE2'!T135","v":12},{"$f":"TSS!T135","v":6},{"$f":"'VE2'!U135","v":144.39999999999998},{"$f":"TSS!U135","v":49.399999999999991},{"$f":"'VE2'!V135","v":252.7},{"$f":"TSS!V135","v":86.449999999999989},{"$f":"'VE2'!I135","v":38},{"$f":"TSS!I135","v":13},"Vertical Inside Elbow",{"$f":"'VE2'!W135","v":18},{"$f":"TSS!W135","v":9},{"$f":"'VE2'!X135","v":3},{"$f":"TSS!X135","v":1.5},{"$f":"'VE2'!AN135","v":1.4},{"$f":"TSS!AN135","v":0.4},{"$f":"N11*ProjectData!$C$16","v":1350},{"$f":"O11*ProjectData!$C$16","v":675},{"$f":"P11*ProjectData!$C$15","v":225},{"$f":"Q11*ProjectData!$C$15","v":112.5},{"$f":"R11*ProjectData!$C$14","v":105},{"$f":"S11*ProjectData!$C$14","v":30},null,{"$f":"'VE2'!AB135","v":12},{"$f":"TSS!AB135","v":6},{"$f":"'VE2'!AD135","v":0},{"$f":"TSS!AD135","v":0},{"$f":"'VE2'!Z135","v":12},{"$f":"TSS!Z135","v":0},{"$f":"'VE2'!G267","v":240},{"$f":"TSS!G267","v":24},null,null,null,null,null,null,null,null,{"$f":"'VE2'!AL160","v":0.4},{"$f":"TSS!AL160","v":0.2},{"$f":"'VE2'!AM160","v":0},{"$f":"TSS!AM160","v":0},{"$f":"'VE2'!AK160","v":1},{"$f":"TSS!AK160","v":0.2},null,null,null,null,null,null,null,null,null,null,{"$f":"'VE2'!H267","v":1.4},{"$f":"TSS!H267","v":0.4},null,{"$f":"'VE2'!I267","v":105},{"$f":"TSS!I267","v":30},null,{"$f":"'VE2'!O267","v":0},{"$f":"TSS!O267","v":0},{"$f":"'VE2'!P267","v":0},{"$f":"TSS!P267","v":0},{"$f":"'VE2'!M267","v":0},{"$f":"TSS!M267","v":0},{"$f":"'VE2'!N267","v":0},{"$f":"TSS!N267","v":0},{"$f":"'VE2'!R267","v":0},{"$f":"TSS!R267","v":0},{"$f":"'VE2'!T267","v":0},{"$f":"TSS!T267","v":0},null,"SUPPORT QTY (ea)",null,"SUPPORT WEIGHT (lbs)",null,"SUPPORT COST (usd)",null,"CLAMP QTY (prs)",null,"HARDWARE (pcs)",null,"INSTALLATION TIME (hrs)",null,"INSTALLATION COST (usd)",null,null,{"$f":"'VE2'!D286","v":26},{"$f":"TSS!D286","v":0},{"$f":"'VE2'!E286","v":48},{"$f":"TSS!E286","v":15},{"$f":"'VE2'!F286","v":48},{"$f":"TSS!F286","v":12},{"$f":"'VE2'!G286","v":48},{"$f":"TSS!G286","v":48},{"$f":"'VE2'!D305","v":98.8},{"$f":"TSS!D305","v":0},{"$f":"'VE2'!F305","v":10.08},{"$f":"TSS!F305","v":3.15},{"$f":"'VE2'!H305","v":592.80000000000007},{"$f":"TSS!H305","v":0},{"$f":"'VE2'!I305","v":120.96000000000001},{"$f":"TSS!I305","v":37.799999999999997},{"$f":"'VE2'!H286","v":1.4},{"$f":"TSS!H286","v":0.2},{"$f":"'VE2'!I286","v":105},{"$f":"TSS!I286","v":15},null,{"$f":"'VE2'!D324","v":12},{"$f":"TSS!D324","v":0},{"$f":"'VE2'!E324","v":0},{"$f":"TSS!E324","v":0},{"$f":"'VE2'!F324","v":48},{"$f":"TSS!F324","v":0},{"$f":"'VE2'!G324","v":6.6666666666666671E-3},{"$f":"TSS!G324","v":0},{"$f":"'VE2'!H324","v":0.5},{"$f":"TSS!H324","v":0}]
[null,"Vertical Outside Elbow",{"$f":"'VE2'!B160","v":6},null,{"$f":"'VE2'!T160","v":12},{"$f":"TSS!T160","v":6},{"$f":"'VE2'!U160","v":173.28},{"$f":"TSS!U160","v":49.399999999999991},{"$f":"'VE2'!V160","v":303.24},{"$f":"TSS!V160","v":86.449999999999989},{"$f":"'VE2'!I160","v":45.6},{"$f":"TSS!I160","v":13},"Vertical Outside Elbow",{"$f":"'VE2'!W160","v":18},{"$f":"TSS!W160","v":9},{"$f":"'VE2'!X160","v":3},{"$f":"TSS!X160","v":1.5},{"$f":"'VE2'!AN160","v":1.4},{"$f":"TSS!AN160","v":0.4},{"$f":"N12*ProjectData!$C$16","v":1350},{"$f":"O12*ProjectData!$C$16","v":675},{"$f":"P12*ProjectData!$C$15","v":225},{"$f":"Q12*ProjectData!$C$15","v":112.5},{"$f":"R12*ProjectData!$C$14","v":105},{"$f":"S12*ProjectData!$C$14","v":30},null,{"$f":"'VE2'!AB160","v":12},{"$f":"TSS!AB160","v":6},{"$f":"'VE2'!AD160","v":0},{"$f":"TSS!AD160","v":0},{"$f":"'VE2'!Z160","v":12},{"$f":"TSS!Z160","v":0},{"$f":"'VE2'!G268","v":240},{"$f":"TSS!G268","v":24},null,null,null,null,null,null,null,null,{"$f":"'VE2'!AL171","v":0},{"$f":"TSS!AL171","v":0},{"$f":"'VE2'!AM171","v":0},{"$f":"TSS!AM171","v":0},{"$f":"'VE2'!AK171","v":0},{"$f":"TSS!AK171","v":0},null,null,null,null,null,null,null,null,null,null,{"$f":"'VE2'!H268","v":1.4},{"$f":"TSS!H268","v":0.4},null,{"$f":"'VE2'!I268","v":105},{"$f":"TSS!I268","v":30},null,{"$f":"'VE2'!O268","v":0},{"$f":"TSS!O268","v":0},{"$f":"'VE2'!P268","v":0},{"$f":"TSS!P268","v":0},{"$f":"'VE2'!M268","v":0},{"$f":"TSS!M268","v":0},{"$f":"'VE2'!N268","v":0},{"$f":"TSS!N268","v":0},{"$f":"'VE2'!R268","v":0},{"$f":"TSS!R268","v":0},{"$f":"'VE2'!T268","v":0},{"$f":"TSS!T268","v":0},null,"NEMA","TSS","NEMA","TSS","NEMA","TSS","NEMA","TSS","NEMA","TSS","NEMA","TSS","NEMA","TSS",null,{"$f":"'VE2'!D287","v":26},{"$f":"TSS!D287","v":0},{"$f":"'VE2'!E287","v":48},{"$f":"TSS!E287","v":15},{"$f":"'VE2'!F287","v":48},{"$f":"TSS!F287","v":12},{"$f":"'VE2'!G287","v":48},{"$f":"TSS!G287","v":48},{"$f":"'VE2'!D306","v":98.8},{"$f":"TSS!D306","v":0},{"$f":"'VE2'!F306","v":10.08},{"$f":"TSS!F306","v":3.15},{"$f":"'VE2'!H306","v":592.80000000000007},{"$f":"TSS!H306","v":0},{"$f":"'VE2'!I306","v":120.96000000000001},{"$f":"TSS!I306","v":37.799999999999997},{"$f":"'VE2'!H287","v":1.4},{"$f":"TSS!H287","v":0.2},{"$f":"'VE2'!I287","v":105},{"$f":"TSS!I287","v":15},null,{"$f":"'VE2'!D325","v":12},{"$f":"TSS!D325","v":0},{"$f":"'VE2'!E325","v":0},{"$f":"TSS!E325","v":0},{"$f":"'VE2'!F325","v":48},{"$f":"TSS!F325","v":0},{"$f":"'VE2'!G325","v":6.6666666666666671E-3},{"$f":"TSS!G325","v":0},{"$f":"'VE2'!H325","v":0.5},{"$f":"TSS!H325","v":0}]
[null,"4\" Expansion Joint",{"$f":"'VE2'!B171","v":0},null,{"$f":"'VE2'!T171","v":0},{"$f":"TSS!T171","v":0},{"$f":"'VE2'!U171","v":0},{"$f":"TSS!U171","v":0},{"$f":"'VE2'!V171","v":0},{"$f":"TSS!V171","v":0},{"$f":"'VE2'!I171","v":0},{"$f":"TSS!I171","v":0},"4\" Expansion Joint",{"$f":"'VE2'!W171","v":0},{"$f":"TSS!W171","v":0},{"$f":"'VE2'!X171","v":0},{"$f":"TSS!X171","v":0},{"$f":"'VE2'!AN171","v":0},{"$f":"TSS!AN171","v":0},{"$f":"N13*ProjectData!$C$16","v":0},{"$f":"O13*ProjectData!$C$16","v":0},{"$f":"P13*ProjectData!$C$15","v":0},{"$f":"Q13*ProjectData!$C$15","v":0},{"$f":"R13*ProjectData!$C$14","v":0},{"$f":"S13*ProjectData!$C$14","v":0},null,{"$f":"'VE2'!AB171","v":0},{"$f":"TSS!AB171","v":0},{"$f":"'VE2'!AD171","v":0},{"$f":"TSS!AD171","v":0},{"$f":"'VE2'!Z171","v":0},{"$f":"TSS!Z171","v":0},{"$f":"'VE2'!G269","v":0},{"$f":"TSS!G269","v":0},null,null,null,null,null,null,null,null,{"$f":"'VE2'!AL182","v":0},{"$f":"TSS!AL182","v":0},{"$f":"'VE2'!AM182","v":1},{"$f":"TSS!AM182","v":0},{"$f":"'VE2'!AK182","v":1.5},{"$f":"TSS!AK182","v":0.26666666666666666},null,null,null,null,null,null,null,null,null,null,{"$f":"'VE2'!H269","v":0},{"$f":"TSS!H269","v":0},null,{"$f":"'VE2'!I269","v":0},{"$f":"TSS!I269","v":0},null,{"$f":"'VE2'!O269","v":0},{"$f":"TSS!O269","v":0},{"$f":"'VE2'!P269","v":0},{"$f":"TSS!P269","v":0},{"$f":"'VE2'!M269","v":0},{"$f":"TSS!M269","v":0},{"$f":"'VE2'!N269","v":0},{"$f":"TSS!N269","v":0},{"$f":"'VE2'!R269","v":0},{"$f":"TSS!R269","v":0},{"$f":"'VE2'!T269","v":0},{"$f":"TSS!T269","v":0},null,{"$f":"'VE2'!L289","v":0},{"$f":"TSS!L289","v":0},{"$f":"'VE2'!M289","v":0},{"$f":"TSS!M289","v":0},{"$f":"'VE2'!P289","v":0},{"$f":"TSS!P289","v":0},{"$f":"'VE2'!Q289","v":0},{"$f":"TSS!Q289","v":0},{"$f":"'VE2'!R289","v":0},{"$f":"TSS!R289","v":0},{"$f":"'VE2'!T289","v":0},{"$f":"TSS!T289","v":0},{"$f":"'VE2'!U289","v":0},{"$f":"TSS!U289","v":0},null,{"$f":"'VE2'!D288","v":0},{"$f":"TSS!D288","v":0},{"$f":"'VE2'!E288","v":0},{"$f":"TSS!E288","v":0},{"$f":"'VE2'!F288","v":0},{"$f":"TSS!F288","v":0},{"$f":"'VE2'!G288","v":0},{"$f":"TSS!G288","v":0},{"$f":"'VE2'!D307","v":0},{"$f":"TSS!D307","v":0},{"$f":"'VE2'!F307","v":0},{"$f":"TSS!F307","v":0},{"$f":"'VE2'!H307","v":0},{"$f":"TSS!H307","v":0},{"$f":"'VE2'!I307","v":0},{"$f":"TSS!I307","v":0},{"$f":"'VE2'!H288","v":0},{"$f":"TSS!H288","v":0},{"$f":"'VE2'!I288","v":0},{"$f":"TSS!I288","v":0},null,{"$f":"'VE2'!D326","v":0},{"$f":"TSS!D326","v":0},{"$f":"'VE2'!E326","v":0},{"$f":"TSS!E326","v":0},{"$f":"'VE2'!F326","v":0},{"$f":"TSS!F326","v":0},{"$f":"'VE2'!G326","v":0},{"$f":"TSS!G326","v":0},{"$f":"'VE2'!H326","v":0},{"$f":"TSS!H326","v":0}]
[null,"6\" Expansion Joint",{"$f":"'VE2'!B182","v":15},null,{"$f":"'VE2'!T182","v":30},{"$f":"TSS!T182","v":0},{"$f":"'VE2'!U182","v":361},{"$f":"TSS!U182","v":0},{"$f":"'VE2'!V182","v":2797.75},{"$f":"TSS!V182","v":0},{"$f":"'VE2'!I182","v":95},{"$f":"TSS!I182","v":0},"6\" Expansion Joint",{"$f":"'VE2'!W182","v":15},{"$f":"TSS!W182","v":0},{"$f":"'VE2'!X182","v":7.5},{"$f":"TSS!X182","v":0},{"$f":"'VE2'!AN182","v":2.5},{"$f":"TSS!AN182","v":0.26666666666666666},{"$f":"N14*ProjectData!$C$16","v":1125},{"$f":"O14*ProjectData!$C$16","v":0},{"$f":"P14*ProjectData!$C$15","v":562.5},{"$f":"Q14*ProjectData!$C$15","v":0},{"$f":"R14*ProjectData!$C$14","v":187.5},{"$f":"S14*ProjectData!$C$14","v":20},null,{"$f":"'VE2'!AB182","v":0},{"$f":"TSS!AB182","v":0},{"$f":"'VE2'!AD182","v":30},{"$f":"TSS!AD182","v":0},{"$f":"'VE2'!Z182","v":15},{"$f":"TSS!Z182","v":15},{"$f":"'VE2'!G270","v":360},{"$f":"TSS!G270","v":60},null,null,null,null,null,null,null,null,{"$f":"'VE2'!AL187","v":0},{"$f":"TSS!AL187","v":0},{"$f":"'VE2'!AM187","v":0},{"$f":"TSS!AM187","v":0},{"$f":"'VE2'!AK187","v":0},{"$f":"TSS!AK187","v":0},null,null,null,null,null,null,null,null,null,null,{"$f":"'VE2'!H270","v":2.5},{"$f":"TSS!H270","v":0.26666666666666666},null,{"$f":"'VE2'!I270","v":187.49999999999997},{"$f":"TSS!I270","v":20},null,{"$f":"'VE2'!O270","v":0},{"$f":"TSS!O270","v":0},{"$f":"'VE2'!P270","v":0},{"$f":"TSS!P270","v":0},{"$f":"'VE2'!M270","v":0},{"$f":"TSS!M270","v":0},{"$f":"'VE2'!N270","v":0},{"$f":"TSS!N270","v":0},{"$f":"'VE2'!R270","v":0},{"$f":"TSS!R270","v":0},{"$f":"'VE2'!T270","v":0},{"$f":"TSS!T270","v":0},null,null,null,null,null,null,null,null,null,null,null,null,null,null,null,null,{"$f":"'VE2'!D289","v":65},{"$f":"TSS!D289","v":0},{"$f":"'VE2'!E289","v":120},{"$f":"TSS!E289","v":0},{"$f":"'VE2'!F289","v":120},{"$f":"TSS!F289","v":0},{"$f":"'VE2'!G289","v":120},{"$f":"TSS!G289","v":0},{"$f":"'VE2'!D308","v":247},{"$f":"TSS!D308","v":0},{"$f":"'VE2'!F308","v":25.2},{"$f":"TSS!F308","v":0},{"$f":"'VE2'!H308","v":1482},{"$f":"TSS!H308","v":0},{"$f":"'VE2'!I308","v":302.39999999999998},{"$f":"TSS!I308","v":0},{"$f":"'VE2'!H289","v":3.5},{"$f":"TSS!H289","v":0},{"$f":"'VE2'!I289","v":262.5},{"$f":"TSS!I289","v":0},null,{"$f":"'VE2'!D327","v":0},{"$f":"TSS!D327","v":0},{"$f":"'VE2'!E327","v":30},{"$f":"TSS!E327","v":0},{"$f":"'VE2'!F327","v":120},{"$f":"TSS!F327","v":0},{"$f":"'VE2'!G327","v":1.6666666666666666E-2},{"$f":"TSS!G327","v":0},{"$f":"'VE2'!H327","v":1.25},{"$f":"TSS!H327","v":0}]
[null,"HADJ Adjustable Splice",{"$f":"'VE2'!B187","v":0},null,{"$f":"'VE2'!T187","v":0},{"$f":"TSS!T187","v":0},{"$f":"'VE2'!U187","v":0},{"$f":"TSS!U187","v":0},{"$f":"'VE2'!V187","v":0},{"$f":"TSS!V187","v":0},{"$f":"'VE2'!J187","v":0},{"$f":"TSS!J187","v":0},"HADJ Adjustable Splice",{"$f":"'VE2'!W187","v":0},{"$f":"TSS!W187","v":0},{"$f":"'VE2'!X187","v":0},{"$f":"TSS!X187","v":0},{"$f":"'VE2'!AN187","v":0},{"$f":"TSS!AN187","v":0},{"$f":"N15*ProjectData!$C$16","v":0},{"$f":"O15*ProjectData!$C$16","v":0},{"$f":"P15*ProjectData!$C$15","v":0},{"$f":"Q15*ProjectData!$C$15","v":0},{"$f":"R15*ProjectData!$C$14","v":0},{"$f":"S15*ProjectData!$C$14","v":0},null,{"$f":"'VE2'!AB187","v":0},{"$f":"TSS!AB187","v":0},{"$f":"'VE2'!AD187","v":0},{"$f":"TSS!AD187","v":0},{"$f":"'VE2'!Z187","v":0},{"$f":"TSS!Z187","v":0},{"$f":"'VE2'!G271","v":0},{"$f":"TSS!G271","v":0},null,null,null,null,null,null,null,null,{"$f":"'VE2'!AL192","v":0},{"$f":"TSS!AL192","v":0},{"$f":"'VE2'!AM192","v":0},{"$f":"TSS!AM192","v":0},{"$f":"'VE2'!AK192","v":0},{"$f":"TSS!AK192","v":0},null,null,null,null,null,null,null,null,null,null,{"$f":"'VE2'!H271","v":0},{"$f":"TSS!H271","v":0},null,{"$f":"'VE2'!I271","v":0},{"$f":"TSS!I271","v":0},null,{"$f":"'VE2'!O271","v":0},{"$f":"TSS!O271","v":0},{"$f":"'VE2'!P271","v":0},{"$f":"TSS!P271","v":0},{"$f":"'VE2'!M271","v":0},{"$f":"TSS!M271","v":0},{"$f":"'VE2'!N271","v":0},{"$f":"TSS!N271","v":0},{"$f":"'VE2'!R271","v":0},{"$f":"TSS!R271","v":0},{"$f":"'VE2'!T271","v":0},{"$f":"TSS!T271","v":0},null,null,{"$f":"TSS!O250","v":"No QTY"},null,{"$f":"TSS!O251","v":"No QTY"},null,{"$f":"TSS!O252","v":"No QTY"},null,{"$f":"TSS!O253","v":"No QTY"},null,{"$f":"TSS!O254","v":"No QTY"},null,{"$f":"TSS!O255","v":"No QTY"},null,{"$f":"TSS!O256","v":"No QTY"},null,{"$f":"'VE2'!D290","v":0},{"$f":"TSS!D290","v":0},{"$f":"'VE2'!E290","v":0},{"$f":"TSS!E290","v":0},{"$f":"'VE2'!F290","v":0},{"$f":"TSS!F290","v":0},{"$f":"'VE2'!G290","v":0},{"$f":"TSS!G290","v":0},{"$f":"'VE2'!D309","v":0},{"$f":"TSS!D309","v":0},{"$f":"'VE2'!F309","v":0},{"$f":"TSS!F309","v":0},{"$f":"'VE2'!H309","v":0},{"$f":"TSS!H309","v":0},{"$f":"'VE2'!I309","v":0},{"$f":"TSS!I309","v":0},{"$f":"'VE2'!H290","v":0},{"$f":"TSS!H290","v":0},{"$f":"'VE2'!I290","v":0},{"$f":"TSS!I290","v":0},null,{"$f":"'VE2'!D328","v":0},{"$f":"TSS!D328","v":0},{"$f":"'VE2'!E328","v":0},{"$f":"TSS!E328","v":0},{"$f":"'VE2'!F328","v":0},{"$f":"TSS!F328","v":0},{"$f":"'VE2'!G328","v":0},{"$f":"TSS!G328","v":0},{"$f":"'VE2'!H328","v":0},{"$f":"TSS!H328","v":0}]
[null,"VADJ Adjustable Splice",{"$f":"'VE2'!B192","v":0},null,{"$f":"'VE2'!T192","v":0},{"$f":"TSS!T192","v":0},{"$f":"'VE2'!U192","v":0},{"$f":"TSS!U192","v":0},{"$f":"'VE2'!V192","v":0},{"$f":"TSS!V192","v":0},{"$f":"'VE2'!J192","v":0},{"$f":"TSS!J192","v":0},"VADJ Adjustable Splice",{"$f":"'VE2'!W192","v":0},{"$f":"TSS!W192","v":0},{"$f":"'VE2'!X192","v":0},{"$f":"TSS!X192","v":0},{"$f":"'VE2'!AN192","v":0},{"$f":"TSS!AN192","v":0},{"$f":"N16*ProjectData!$C$16","v":0},{"$f":"O16*ProjectData!$C$16","v":0},{"$f":"P16*ProjectData!$C$15","v":0},{"$f":"Q16*ProjectData!$C$15","v":0},{"$f":"R16*ProjectData!$C$14","v":0},{"$f":"S16*ProjectData!$C$14","v":0},null,{"$f":"'VE2'!AB192","v":0},{"$f":"TSS!AB192","v":0},{"$f":"'VE2'!AD192","v":0},{"$f":"TSS!AD192","v":0},{"$f":"'VE2'!Z192","v":0},{"$f":"TSS!Z192","v":0},{"$f":"'VE2'!G272","v":0},{"$f":"TSS!G272","v":0},null,null,null,null,null,null,null,null,{"$f":"'VE2'!AL197","v":0},{"$f":"TSS!AL197","v":0},{"$f":"'VE2'!AM197","v":0},{"$f":"TSS!AM197","v":0},{"$f":"'VE2'!AK197","v":0},{"$f":"TSS!AK197","v":0},null,null,null,null,null,null,null,null,null,null,{"$f":"'VE2'!H272","v":0},{"$f":"TSS!H272","v":0},null,{"$f":"'VE2'!I272","v":0},{"$f":"TSS!I272","v":0},null,{"$f":"'VE2'!O272","v":0},{"$f":"TSS!O272","v":0},{"$f":"'VE2'!P272","v":0},{"$f":"TSS!P272","v":0},{"$f":"'VE2'!M272","v":0},{"$f":"TSS!M272","v":0},{"$f":"'VE2'!N272","v":0},{"$f":"TSS!N272","v":0},{"$f":"'VE2'!R272","v":0},{"$f":"TSS!R272","v":0},{"$f":"'VE2'!T272","v":0},{"$f":"TSS!T272","v":0},null,null,null,null,null,null,null,null,null,null,null,null,null,null,null,null,{"$f":"'VE2'!D291","v":0},{"$f":"TSS!D291","v":0},{"$f":"'VE2'!E291","v":0},{"$f":"TSS!E291","v":0},{"$f":"'VE2'!F291","v":0},{"$f":"TSS!F291","v":0},{"$f":"'VE2'!G291","v":0},{"$f":"TSS!G291","v":0},{"$f":"'VE2'!D310","v":0},{"$f":"TSS!D310","v":0},{"$f":"'VE2'!F310","v":0},{"$f":"TSS!F310","v":0},{"$f":"'VE2'!H310","v":0},{"$f":"TSS!H310","v":0},{"$f":"'VE2'!I310","v":0},{"$f":"TSS!I310","v":0},{"$f":"'VE2'!H291","v":0},{"$f":"TSS!H291","v":0},{"$f":"'VE2'!I291","v":0},{"$f":"TSS!I291","v":0},null,{"$f":"'VE2'!D329","v":0},{"$f":"TSS!D329","v":0},{"$f":"'VE2'!E329","v":0},{"$f":"TSS!E329","v":0},{"$f":"'VE2'!F329","v":0},{"$f":"TSS!F329","v":0},{"$f":"'VE2'!G329","v":0},{"$f":"TSS!G329","v":0},{"$f":"'VE2'!H329","v":0},{"$f":"TSS!H329","v":0}]
[null,"Reducers",{"$f":"'VE2'!B197","v":0},null,{"$f":"'VE2'!T197","v":0},{"$f":"TSS!T197","v":0},{"$f":"'VE2'!U197","v":0},{"$f":"TSS!U197","v":0},{"$f":"'VE2'!V197","v":0},{"$f":"TSS!V197","v":0},{"$f":"'VE2'!J197","v":0},{"$f":"TSS!J197","v":0},"Reducers",{"$f":"'VE2'!W197","v":0},{"$f":"TSS!W197","v":0},{"$f":"'VE2'!X197","v":0},{"$f":"TSS!X197","v":0},{"$f":"'VE2'!AN197","v":0},{"$f":"TSS!AN197","v":0},{"$f":"N17*ProjectData!$C$16","v":0},{"$f":"O17*ProjectData!$C$16","v":0},{"$f":"P17*ProjectData!$C$15","v":0},{"$f":"Q17*ProjectData!$C$15","v":0},{"$f":"R17*ProjectData!$C$14","v":0},{"$f":"S17*ProjectData!$C$14","v":0},null,{"$f":"'VE2'!AB197","v":0},{"$f":"TSS!AB197","v":0},{"$f":"'VE2'!AD197","v":0},{"$f":"TSS!AD197","v":0},{"$f":"'VE2'!Z197","v":0},{"$f":"TSS!Z197","v":0},{"$f":"'VE2'!G273","v":0},{"$f":"TSS!G273","v":0},null,null,null,null,null,null,null,null,null,null,null,null,null,null,null,null,null,null,null,null,null,null,null,null,{"$f":"'VE2'!H273","v":0},{"$f":"TSS!H273","v":0},null,{"$f":"'VE2'!I273","v":0},{"$f":"TSS!I273","v":0},null,{"$f":"'VE2'!O273","v":0},{"$f":"TSS!O273","v":0},{"$f":"'VE2'!P273","v":0},{"$f":"TSS!P273","v":0},{"$f":"'VE2'!M273","v":0},{"$f":"TSS!M273","v":0},{"$f":"'VE2'!N273","v":0},{"$f":"TSS!N273","v":0},{"$f":"'VE2'!R273","v":0},{"$f":"TSS!R273","v":0},{"$f":"'VE2'!T273","v":0},{"$f":"TSS!T273","v":0},null,null,null,null,null,null,null,null,null,null,null,null,null,null,null,null,{"$f":"'VE2'!D292","v":0},{"$f":"TSS!D292","v":0},{"$f":"'VE2'!E292","v":0},{"$f":"TSS!E292","v":0},{"$f":"'VE2'!F292","v":0},{"$f":"TSS!F292","v":0},{"$f":"'VE2'!G292","v":0},{"$f":"TSS!G292","v":0},{"$f":"'VE2'!D311","v":0},{"$f":"TSS!D311","v":0},{"$f":"'VE2'!F311","v":0},{"$f":"TSS!F311","v":0},{"$f":"'VE2'!H311","v":0},{"$f":"TSS!H311","v":0},{"$f":"'VE2'!I311","v":0},{"$f":"TSS!I311","v":0},{"$f":"'VE2'!H292","v":0},{"$f":"TSS!H292","v":0},{"$f":"'VE2'!I292","v":0},{"$f":"TSS!I292","v":0},null,{"$f":"'VE2'!D330","v":0},{"$f":"TSS!D330","v":0},{"$f":"'VE2'!E330","v":0},{"$f":"TSS!E330","v":0},{"$f":"'VE2'!F330","v":0},{"$f":"TSS!F330","v":0},{"$f":"'VE2'!G330","v":0},{"$f":"TSS!G330","v":0},{"$f":"'VE2'!H330","v":0},{"$f":"TSS!H330","v":0}]
[]
[null,null,null,null,null,null,"Structure lbs",null,"Structure Cost",null,"Structure Linear Feet",null,null,"Structural Design",null,"Structural Installation",null,"Tray Installation",null,"Structural Design",null,"Structural Installation",null,"Tray Installation",null,null,"Tray Accessories",null,null,null,null,null,"Hardware",null,"Tray Accessories",null,null,null,null,null,"Hardware",null,"Tray Accessories","Chart",null,null,null,null,null,null,null,null,null,null,null,null,null,null,"Chart",null,null,"Chart",null,null,null,null,null,null,"ACC ",null,"Hardware",null,"Tray Installation",null,"Tray Install Cost",null,null,"Chart",null,null,null,null,null,null,null,null,null,null,null,null,null,null,null,null,null,null,null,null,null,null,null,null,null,null,null,null,null,null,null,null,null,null,null,"Chart or special Note (index match based on input selection) Summary Sheet",null,null,null,null,null,null,null,null,null,null,null,null,null,null,null,null,null,null,null,null,null,null,null,null,"Logistics"]
[null,"Everything Else","TOTALS:",null,"STRUCTURE",null,null,null,null,null,null,null,null,"SKILLED LABOR Hours",null,null,null,null,null,"SKILLED LABOR Cost",null,null,null,null,null,null,"TRAY ACCESSORY QUANTITY",null,null,null,null,null,null,null,"TRAY ACCESSORY Cost",null,null,null,null,null,null,null,"TRAY ACCESSORY INSTALLATION TIME (HRS)",null,null,null,null,null,null,null,null,null,null,null,null,null,null,null,"TOTAL TRAY INSTALLATION TIME (HRS)",null,null,"TOTAL TRAY INSTALLATION COST (USD)",null,null,"COVERS & COVER CLAMPS",null,null,null,null,null,null,null,null,null,null,null,null,"REDUCERS",null,null,null,null,null,null,null,null,null,null,null,null,null,null,"STRUT TRAPEZE SUPPORT COSTS & INSTALLATION TIME",null,null,null,null,null,null,null,null,null,null,null,null,null,null,null,null,null,null,null,null,"STRUT TRAPEZE SUPPORT : TRAY CLAMPS & GUIDES",null,null,null,null,null,null,null,null,null,null,"MATERIAL HANDLING QUANTITY",null,null,null,null,null,null,"MATERIAL HANDLING COST (USD)",null,null,null,null,null,null,"Name",{"$f":"ProjectData!H13","v":"40ft Flat Bed"}]
[null,null,null,null,"Support Quantity (PCS)",null,"Support Weight (LBS)",null,"Support Cost (USD)",null,"Support Linear Length (FT)",null,null,"Structural Engineer (HRS)",null,"Steel Erector (HRS)",null,"Tray Installer (HRS)",null,"Structural Engineer (HRS)",null,"Steel Erector (HRS)",null,"Tray Installer (HRS)",null,null,"Clamp Quantity",null,"Guide Quantity",null,"Splice Quantity",null,"Hardware Quantity",null,"Clamp Cost",null,"Guide Cost",null,"Splice Cost",null,"Hardware Cost",null,"Clamp Installation Time (HRS)",null,"Guide Installation Time (HRS)",null,"Splice/Link Installation Time (HRS)",null,null,null,null,null,null,null,null,null,null,null,"All Tray Accessory Items",null,null,"All Tray Accessory Items",null,null,"COVER WEIGHT (lbs)",null,"COVER CLAMP WEIGHT (lbs)",null,"COVER CLAMP QTY (ea)",null,"HARDWARE QTY (pcs)",null,"INSTALLATION TIME (hrs)",null,"INSTALLATION COST (usd)",null,null,"SUPPORT QTY (ea)",null,"SUPPORT WEIGHT (lbs)",null,"SUPPORT COST (usd)",null,"CLAMP QTY (prs)",null,"HARDWARE (pcs)",null,"INSTALLATION TIME (hrs)",null,"INSTALLATION COST (usd)",null,null,"STRUT QUANTITY (FT)",null,"ATR QUANTITY (FT)",null,"FITTINGS QUANTITY (PCS)",null,"HDWR QUANTITY (PCS)",null,"STRUT WEIGHT (LBS)",null,"ATR WEIGHT (LBS)",null,"STRUT COST (USD)",null,"ATR COST (USD)",null,"INSTALLATION TIME (HRS)",null,"INSTALLATION COST (USD)",null,null,"CLAMP QUANTITY (PRS)",null,"GUIDE QUANTITY (PRS)",null,"HDWR QUANTITY (PCS)",null,"INSTALLATION TIME (HRS)",null,"INSTALLATION COST (USD)",null,null,"30' Hot Shot Qty",null,"40' Flat Bed Qty",null,"40' Container Qty",null,null,"30' Hot Shot Cost",null,"40' Flat Bed Cost",null,"40' Container Cost",null,null,"NEMA QTY",{"$f":"IF(EJ20=\"30ft Hot Shot\",DU23,IF(EJ20=\"40ft Flat Bed\",DW23,IF(EJ20=\"40ft Container\",DY23,\"N/A\")))","v":6.4429E-2},"total amount of truck required for structure"]
[null,null,null,null,"NEMA","TSS","NEMA","TSS","NEMA","TSS","NEMA","TSS",null,"NEMA","TSS","NEMA","TSS","NEMA","TSS","NEMA","TSS","NEMA","TSS","NEMA","TSS",null,"NEMA","TSS","NEMA","TSS","NEMA","TSS","NEMA","TSS","NEMA","TSS","NEMA","TSS","NEMA","TSS","NEMA","TSS","NEMA","TSS","NEMA","TSS","NEMA","TSS",null,null,null,null,null,null,null,null,null,null,"NEMA","TSS",null,"NEMA","TSS",null,"NEMA","TSS","NEMA","TSS","NEMA","TSS","NEMA","TSS","NEMA","TSS","NEMA","TSS",null,"NEMA","TSS","NEMA","TSS","NEMA","TSS","NEMA","TSS","NEMA","TSS","NEMA","TSS","NEMA","TSS",null,"NEMA","TSS","NEMA","TSS","NEMA","TSS","NEMA","TSS","NEMA","TSS","NEMA","TSS","NEMA","TSS","NEMA","TSS","NEMA","TSS","NEMA","TSS",null,"NEMA","TSS","NEMA","TSS","NEMA","TSS","NEMA","TSS","NEMA","TSS",null,"NEMA","TSS","NEMA","TSS","NEMA","TSS",null,"NEMA","TSS","NEMA","TSS","NEMA","TSS",null,"TSS QTY",{"$f":"IF(EJ20=\"30ft Hot Shot\",DV23,IF(EJ20=\"40ft Flat Bed\",DX23,IF(EJ20=\"40ft Container\",DZ23,\"N/A\")))","v":3.0684999999999997E-2}]
[null,null,null,null,{"$f":"'VE2'!E210","v":119},{"$f":"TSS!E210","v":71},{"$f":"'VE2'!E212","v":1288.58},{"$f":"TSS!E212","v":613.69999999999993},{"$f":"'VE2'!E214","v":8080.415},{"$f":"TSS!E214","v":4163.375},{"$f":"'VE2'!E213","v":339.1},{"$f":"TSS!E213","v":161.5},null,{"$f":"'VE2'!E216","v":100.25},{"$f":"TSS!E216","v":56.25},{"$f":"'VE2'!E220","v":29.75},{"$f":"TSS!E220","v":17.75},{"$f":"'VE2'!E242","v":12.583166666666665},{"$f":"TSS!E242","v":4.25},{"$f":"'VE2'!E218","v":7518.75},{"$f":"TSS!E218","v":4218.75},{"$f":"'VE2'!E221","v":2231.25},{"$f":"TSS!E221","v":1331.25},{"$f":"'VE2'!E244","v":943.73749999999984},{"$f":"TSS!E244","v":318.75},null,{"$f":"'VE2'!E228","v":59.9985},{"$f":"TSS!E228","v":42},{"$f":"'VE2'!E234","v":64.996499999999997},{"$f":"TSS!E234","v":36},{"$f":"'VE2'!E222","v":98},{"$f":"TSS!E222","v":15},{"$f":"'VE2'!E240","v":2071.9939999999997},{"$f":"TSS!E240","v":552},{"$f":"'VE2'!E229","v":299.99250000000001},{"$f":"TSS!E229","v":252},{"$f":"'VE2'!E235","v":324.98249999999996},{"$f":"TSS!E235","v":216},null,null,{"$f":"'VE2'!E241","v":1805.9925000000001},{"$f":"TSS!E241","v":1020},{"$f":"'VE2'!E232","v":1.9999500000000001},{"$f":"TSS!E232","v":1.4},{"$f":"'VE2'!E238","v":2.16655},{"$f":"TSS!E238","v":1.2000000000000002},{"$f":"'VE2'!E226","v":8.4166666666666679},{"$f":"TSS!E226","v":1.65},null,null,null,null,null,null,null,null,null,null,{"$f":"'VE2'!E242","v":12.583166666666665},{"$f":"TSS!E242","v":4.25},null,{"$f":"'VE2'!E244","v":943.73749999999984},{"$f":"TSS!E244","v":318.75},null,{"$f":"'VE2'!O275","v":0},{"$f":"TSS!O275","v":0},{"$f":"'VE2'!P275","v":0},{"$f":"TSS!P275","v":0},{"$f":"'VE2'!M275","v":0},{"$f":"TSS!M275","v":0},{"$f":"'VE2'!N275","v":0},{"$f":"TSS!N275","v":0},{"$f":"'VE2'!R275","v":0},{"$f":"TSS!R275","v":0},{"$f":"'VE2'!T275","v":0},{"$f":"TSS!T275","v":0},null,{"$f":"'VE2'!L293","v":0},{"$f":"TSS!L293","v":0},{"$f":"'VE2'!M293","v":0},{"$f":"TSS!M293","v":0},{"$f":"'VE2'!P293","v":0},{"$f":"TSS!P293","v":0},{"$f":"'VE2'!Q293","v":0},{"$f":"TSS!Q293","v":0},{"$f":"'VE2'!R293","v":0},{"$f":"TSS!R293","v":0},{"$f":"'VE2'!T293","v":0},{"$f":"TSS!T293","v":0},{"$f":"'VE2'!U293","v":0},{"$f":"TSS!U293","v":0},null,{"$f":"'VE2'!D294","v":258.5},{"$f":"TSS!D294","v":0},{"$f":"'VE2'!E294","v":476},{"$f":"TSS!E294","v":177.5},{"$f":"'VE2'!F294","v":476},{"$f":"TSS!F294","v":142},{"$f":"'VE2'!G294","v":476},{"$f":"TSS!G294","v":568},{"$f":"'VE2'!D313","v":982.3},{"$f":"TSS!D313","v":0},{"$f":"'VE2'!F313","v":99.96},{"$f":"TSS!F313","v":37.274999999999999},{"$f":"'VE2'!H313","v":5893.8},{"$f":"TSS!H313","v":0},{"$f":"'VE2'!I313","v":1199.52},{"$f":"TSS!I313","v":447.3},{"$f":"'VE2'!H294","v":13.883333333333335},{"$f":"TSS!H294","v":2.3666666666666667},{"$f":"'VE2'!I294","v":1041.25},{"$f":"TSS!I294","v":177.5},null,{"$f":"'VE2'!D332","v":59.9985},{"$f":"TSS!D332","v":0},{"$f":"'VE2'!E332","v":64.996499999999997},{"$f":"TSS!E332","v":0},{"$f":"'VE2'!F332","v":503.99400000000003},{"$f":"TSS!F332","v":0},{"$f":"'VE2'!G332","v":6.9441666666666665E-2},{"$f":"TSS!G332","v":0},{"$f":"'VE2'!H332","v":5.2081249999999999},{"$f":"TSS!H332","v":0},null,{"$f":"'VE2'!E250","v":0.10308639999999999},{"$f":"TSS!E250","v":2.8124999999999999E-3},{"$f":"'VE2'!E246","v":6.4429E-2},{"$f":"TSS!E246","v":3.0684999999999997E-2},{"$f":"'VE2'!E254","v":8.5905333333333334E-2},{"$f":"TSS!E254","v":8.8750000000000005E-4},null,{"$f":"'VE2'!E252","v":566.97519999999997},{"$f":"TSS!E252","v":15.46875},{"$f":"'VE2'!E248","v":515.43200000000002},{"$f":"TSS!E248","v":245.48},{"$f":"'VE2'!E256","v":859.05333333333328},{"$f":"TSS!E256","v":8.875},null,"NEMA Cost",{"$f":"IF(EJ20=\"30ft Hot Shot\",EB23,IF(EJ20=\"40ft Flat Bed\",ED23,IF(EJ20=\"40ft Container\",EF23,\"N/A\")))","v":515.43200000000002}]
[null,null,null,null,null,null,null,null,{"$f":"I23/E23","v":67.902647058823533},{"$f":"J23/F23","v":58.639084507042256},null,null,null,null,null,null,null,null,null,null,null,null,null,null,null,null,null,null,null,null,null,null,null,null,null,null,null,null,null,null,null,null,null,null,null,null,null,null,null,null,null,null,null,null,null,null,null,null,null,null,null,null,null,null,null,null,null,null,{"$f":"TSS!P218","v":0},0,null,null,null,null,null,null,null,null,null,null,null,null,null,null,null,null,null,null,null,null,null,null,null,null,null,null,null,null,null,null,null,null,null,null,null,null,null,null,null,null,null,null,null,null,null,null,null,null,null,null,null,null,null,null,null,null,null,null,null,null,null,null,null,null,null,null,null,null,"TSS Cost",{"$f":"IF(EJ20=\"30ft Hot Shot\",EC23,IF(EJ20=\"40ft Flat Bed\",EE23,IF(EJ20=\"40ft Container\",EG23,\"N/A\")))","v":245.48}]
[null,null,"TSS SAVINGS:",null,null,{"$f":"TSS!K210","v":0.676056338028169},null,{"$f":"TSS!K212","v":1.0996904024767802},null,{"$f":"TSS!K214","v":0.94083285795778671},null,{"$f":"TSS!K213","v":1.0996904024767802},null,null,{"$f":"IFERROR((N23/O23-1),\"Infinite\")","v":0.78222222222222215},null,{"$f":"IFERROR((P23/Q23-1),\"Infinite\")","v":0.676056338028169},null,{"$f":"IFERROR((R23/S23-1),\"Infinite\")","v":1.9607450980392152},null,{"$f":"IFERROR((T23/U23-1),\"Infinite\")","v":0.78222222222222215},null,{"$f":"IFERROR((V23/W23-1),\"Infinite\")","v":0.676056338028169},null,{"$f":"IFERROR((X23/Y23-1),\"Infinite\")","v":1.9607450980392152},null,null,{"$f":"IFERROR((AA23/AB23-1),\"Infinite\")","v":0.42853571428571424},null,{"$f":"IFERROR((AC23/AD23-1),\"Infinite\")","v":0.80545833333333317},null,{"$f":"IFERROR((AE23/AF23-1),\"Infinite\")","v":5.5333333333333332},null,{"$f":"IFERROR((AG23/AH23-1),\"Infinite\")","v":2.7536123188405792},null,{"$f":"IFERROR((AI23/AJ23-1),\"Infinite\")","v":0.19044642857142868},null,{"$f":"IFERROR((AK23/AL23-1),\"Infinite\")","v":0.50454861111111082},null,{"$f":"IFERROR((AM23/AN23-1),\"Infinite\")","v":"Infinite"},null,{"$f":"IFERROR((AO23/AP23-1),\"Infinite\")","v":0.7705808823529412},null,{"$f":"IFERROR((AQ23/AR23-1),\"Infinite\")","v":0.42853571428571446},null,{"$f":"IFERROR((AS23/AT23-1),\"Infinite\")","v":0.80545833333333294},null,{"$f":"IFERROR((AU23/AV23-1),\"Infinite\")","v":4.1010101010101021},null,null,null,null,null,null,null,null,null,null,null,{"$f":"TSS!K242","v":1.9607450980392152},null,null,{"$f":"TSS!K244","v":1.9607450980392152},null,null,{"$f":"TSS!O210","v":0},null,{"$f":"TSS!O212","v":0},null,{"$f":"TSS!O214","v":0},null,{"$f":"TSS!O216","v":0},null,{"$f":"TSS!O222","v":0},null,{"$f":"TSS!O220","v":0},null,null,{"$f":"TSS!T250","v":"No QTY"},null,{"$f":"TSS!T251","v":"No QTY"},null,{"$f":"TSS!T252","v":"No QTY"},null,{"$f":"TSS!T253","v":"No QTY"},null,{"$f":"TSS!T254","v":"No QTY"},null,{"$f":"TSS!T255","v":"No QTY"},null,{"$f":"TSS!T256","v":"No QTY"},null,null,{"$f":"TSS!O227","v":"Infinite"},null,{"$f":"TSS!O231","v":1.6816901408450704},null,{"$f":"TSS!O235","v":2.352112676056338},null,{"$f":"TSS!O237","v":-0.1619718309859155},null,{"$f":"TSS!O228","v":"Infinite"},null,{"$f":"TSS!O232","v":1.6816901408450704},null,{"$f":"TSS!O229","v":"Infinite"},null,{"$f":"TSS!O233","v":1.6816901408450704},null,{"$f":"TSS!O239","v":4.8661971830985919},null,{"$f":"TSS!O240","v":4.8661971830985919},null,null,{"$f":"TSS!D334","v":1},null,{"$f":"TSS!E334","v":1},null,{"$f":"TSS!F334","v":1},null,{"$f":"TSS!G334","v":1},null,{"$f":"TSS!H334","v":1},null,null,{"$f":"TSS!K250","v":35.652942222222222},null,{"$f":"TSS!K246","v":1.0996904024767802},null,{"$f":"TSS!K254","v":95.794741784037555},null,null,{"$f":"TSS!K252","v":35.652942222222222},null,{"$f":"TSS!K248","v":1.0996904024767802},null,{"$f":"TSS!K256","v":95.794741784037555}]
[null,null,null,null,null,{"$f":"TSS!L210","v":48},null,{"$f":"TSS!L212","v":674.88},null,{"$f":"TSS!L214","v":3917.04},null,{"$f":"TSS!L213","v":177.60000000000002},null,null,{"$f":"N23-O23","v":44},null,{"$f":"P23-Q23","v":12},null,{"$f":"R23-S23","v":8.3331666666666653},null,{"$f":"T23-U23","v":3300},null,{"$f":"V23-W23","v":900},null,{"$f":"X23-Y23","v":624.98749999999984},null,null,{"$f":"AA23-AB23","v":17.9985},null,{"$f":"AC23-AD23","v":28.996499999999997},null,{"$f":"AE23-AF23","v":83},null,{"$f":"AG23-AH23","v":1519.9939999999997},null,{"$f":"AI23-AJ23","v":47.992500000000007},null,{"$f":"AK23-AL23","v":108.98249999999996},null,{"$f":"AM23-AN23","v":0},null,{"$f":"AO23-AP23","v":785.99250000000006},null,{"$f":"AQ23-AR23","v":0.59995000000000021},null,{"$f":"AS23-AT23","v":0.9665499999999998},null,{"$f":"AU23-AV23","v":6.7666666666666675},null,null,null,null,null,null,null,null,null,null,null,{"$f":"TSS!L242","v":8.3331666666666653},null,null,{"$f":"TSS!L244","v":624.98749999999984},null,null,{"$f":"TSS!P210","v":0},null,{"$f":"TSS!P212","v":0},null,{"$f":"TSS!P214","v":0},null,{"$f":"TSS!P216","v":0},null,{"$f":"TSS!P222","v":0},null,{"$f":"TSS!P220","v":0},null,null,null,null,null,null,null,null,null,null,null,null,null,null,null,null,null,{"$f":"TSS!P227","v":3452.25},null,{"$f":"TSS!P231","v":3816},null,{"$f":"TSS!P235","v":4464},null,{"$f":"TSS!P237","v":-3312},null,{"$f":"TSS!P228","v":6559.2749999999978},null,{"$f":"TSS!P232","v":801.36},null,{"$f":"TSS!P229","v":9838.9125000000004},null,{"$f":"TSS!P233","v":9616.3200000000033},null,{"$f":"TSS!P239","v":93},null,{"$f":"TSS!P240","v":3060},null,null,{"$f":"TSS!P241","v":778.79909999999995},null,{"$f":"TSS!P242","v":1130.6978999999999},null,{"$f":"TSS!P243","v":7699.8940000000002},null,{"$f":"TSS!P244","v":1.0608316666666668},null,{"$f":"TSS!P245","v":26.520791666666668},null,null,{"$f":"TSS!L250","v":0.1002739},null,{"$f":"TSS!L246","v":3.3744000000000003E-2},null,{"$f":"TSS!L254","v":8.5017833333333334E-2},null,null,{"$f":"TSS!L252","v":551.50644999999997},null,{"$f":"TSS!L248","v":269.952},null,{"$f":"TSS!L256","v":850.17833333333328}]
[]
[null,null,null,null,null,null,null,null,null,null,null,null,null,null,null,null,null,null,null,null,null,null,null,null,null,null,null,null,null,null,null,null,null,null,null,null,null,null,null,null,null,null,null,null,null,null,null,null,null,null,null,null,null,null,null,null,null,null,null,null,null,null,null,null,"Cover Clamps"]
[null,"Strut","TOTALS:",null,"Structure (Strut Model)",null,null,null,null,null,null,null,null,"SKILLED LABOR Hours (Strut Model)",null,null,null,null,null,"SKILLED LABOR Cost (Strut Model)",null,null,null,null,null,null,"TRAY ACCESSORY QUANTITY (Strut Model)",null,null,null,null,null,null,null,"TRAY ACCESSORY Cost (STRUT Model)",null,null,null,null,null,null,null,"TRAY ACCESSORY INSTALLATION TIME (HRS) (Strut Model)",null,null,null,null,null,null,null,null,null,null,null,null,null,null,null,null,null,null,null,null,null,"Weights"]
[null,null,null,null,"Support Quantity (PCS)",null,"Support Weight (LBS)",null,"Support Cost (USD)",null,"Support Linear Length (FT)",null,null,"Structural Engineer (HRS)",null,"Steel Erector (HRS)",null,"Tray Installer (HRS)",null,"Structural Engineer (HRS)",null,"Steel Erector (HRS)",null,"Tray Installer (HRS)",null,null,"Clamp Quantity",null,"Guide Quantity",null,"Splice Quantity",null,"Hardware Quantity",null,"Clamp Cost",null,"Guide Cost",null,"Splice Cost",null,"Hardware Cost",null,"Clamp Installation Time (HRS)",null,"Guide Installation Time (HRS)",null,"Splice/Link Installation Time (HRS)"]
[null,null,null,null,"NEMA","TSS","NEMA","TSS","NEMA","TSS","NEMA","TSS",null,"NEMA","TSS","NEMA","TSS","NEMA","TSS","NEMA","TSS","NEMA","TSS","NEMA","TSS",null,"NEMA","TSS","NEMA","TSS","NEMA","TSS","NEMA","TSS","NEMA","TSS","NEMA","TSS","NEMA","TSS","NEMA","TSS","NEMA","TSS","NEMA","TSS","NEMA","TSS"]
[null,null,null,null,{"$f":"E23","v":119},{"$f":"F23","v":71},{"$f":"G23","v":1288.58},{"$f":"CX23+CZ23","v":37.274999999999999},{"$f":"DA23+DC23","v":7093.32},{"$f":"DB23+DD23","v":447.3},{"$f":"CO23","v":258.5},{"$f":"0","v":0},null,{"$f":"N23*0.25","v":25.0625},{"$f":"O23*0.25","v":14.0625},{"$f":"P23","v":29.75},{"$f":"Q23","v":17.75},{"$f":"DE23+DP23","v":13.952775000000001},{"$f":"DF23+DQ23","v":2.3666666666666667},{"$f":"IFERROR(N32*ProjectData!C16,\"N/A\")","v":1879.6875},{"$f":"IFERROR(O32*ProjectData!C16,\"N/A\")","v":1054.6875},{"$f":"V23","v":2231.25},{"$f":"W23","v":1331.25},{"$f":"DG23+DR23","v":1046.4581250000001},{"$f":"DH23+DS23","v":177.5},null,{"$f":"AA23","v":59.9985},0,{"$f":"AC23","v":64.996499999999997},0,{"$f":"AE23","v":98},{"$f":"AF23","v":15},{"$f":"AG23","v":2071.9939999999997},{"$f":"DK23+DM23+DO23+TSS!E224","v":240},{"$f":"AI23","v":299.99250000000001},0,{"$f":"AK23","v":324.98249999999996},0,null,null,{"$f":"AO23","v":1805.9925000000001},{"$f":"TSS!E225","v":630},{"$f":"AQ23","v":1.9999500000000001},0,{"$f":"AS23","v":2.16655},{"$f":"TSS!E247","v":0},{"$f":"AU23","v":8.4166666666666679},{"$f":"AV23","v":1.65}]
[null,null,null,null,null,null,null,null,{"$f":"I32/E32","v":59.607731092436971}]
[null,null,"TSS SAVINGS:",null,null,{"$f":"IFERROR((E32/F32-1),\"Infinite\")","v":0.676056338028169},null,{"$f":"IFERROR((G32/H32-1),\"Infinite\")","v":33.569550637156269},null,{"$f":"IFERROR((I32/J32-1),\"Infinite\")","v":14.858081824279006},null,{"$f":"IFERROR((K32/L32-1),\"Infinite\")","v":"Infinite"},null,null,{"$f":"IFERROR((N32/O32-1),\"Infinite\")","v":0.78222222222222215},null,{"$f":"IFERROR((P32/Q32-1),\"Infinite\")","v":0.676056338028169},null,{"$f":"IFERROR((R32/S32-1),\"Infinite\")","v":4.8955387323943667},null,{"$f":"IFERROR((T32/U32-1),\"Infinite\")","v":0.78222222222222215},null,{"$f":"IFERROR((V32/W32-1),\"Infinite\")","v":0.676056338028169},null,{"$f":"IFERROR((X32/Y32-1),\"Infinite\")","v":4.8955387323943667},null,null,{"$f":"IFERROR((AA32/AB32-1),\"Infinite\")","v":"Infinite"},null,{"$f":"IFERROR((AC32/AD32-1),\"Infinite\")","v":"Infinite"},null,{"$f":"IFERROR((AE32/AF32-1),\"Infinite\")","v":5.5333333333333332},null,{"$f":"IFERROR((AG32/AH32-1),\"Infinite\")","v":7.633308333333332},null,{"$f":"IFERROR((AI32/AJ32-1),\"Infinite\")","v":"Infinite"},null,{"$f":"IFERROR((AK32/AL32-1),\"Infinite\")","v":"Infinite"},null,{"$f":"IFERROR((AM32/AN32-1),\"Infinite\")","v":"Infinite"},null,{"$f":"IFERROR((AO32/AP32-1),\"Infinite\")","v":1.866654761904762},null,{"$f":"IFERROR((AQ32/AR32-1),\"Infinite\")","v":"Infinite"},null,{"$f":"IFERROR((AS32/AT32-1),\"Infinite\")","v":"Infinite"},null,{"$f":"IFERROR((AU32/AV32-1),\"Infinite\")","v":4.1010101010101021}]
[null,null,null,null,null,{"$f":"E32-F32","v":48},null,{"$f":"G32-H32","v":1251.3049999999998},null,{"$f":"I32-J32","v":6646.0199999999995},null,{"$f":"K32-L32","v":258.5},null,null,{"$f":"N32-O32","v":11},null,{"$f":"P32-Q32","v":12},null,{"$f":"R32-S32","v":11.586108333333334},null,{"$f":"T32-U32","v":825},null,{"$f":"V32-W32","v":900},null,{"$f":"X32-Y32","v":868.95812500000011},null,null,{"$f":"AA32-AB32","v":59.9985},null,{"$f":"AC32-AD32","v":64.996499999999997},null,{"$f":"AE32-AF32","v":83},null,{"$f":"AG32-AH32","v":1831.9939999999997},null,{"$f":"AI32-AJ32","v":299.99250000000001},null,{"$f":"AK32-AL32","v":324.98249999999996},null,{"$f":"AM32-AN32","v":0},null,{"$f":"AO32-AP32","v":1175.9925000000001},null,{"$f":"AQ32-AR32","v":1.9999500000000001},null,{"$f":"AS32-AT32","v":2.16655},null,{"$f":"AU32-AV32","v":6.7666666666666675}]
[null,"Span Optimization"]
[null,"OPTIMIZED SPANS ",null,null,"12FT STRAIGHT SECTIONS NEMA 12C",null,null,null,null,null,null,null,null,null,null,null,null,null,null,null,null,null,null,null,null,null,null,null,null,"SUMMARY GRAND TOTALS"]
[null,"STRAIGHT SECTION","SPAN",null,"Support Quantity (PCS)",null,"Support Weight (LBS)",null,"Support Cost (USD)",null,null,null,"Support Instal Time (HRS)",null,"Splice Quantity (PRS)",null,"Clamp Quantity (PRS)",null,"Guide Quantity (PRS)",null,"Hardware Quantity (PCS)",null,"Tray Installation Time (HRS)",null,"Tray Installation Cost (USD)",null,"OPTIMIZATION FACTOR",null,null,"TOTAL COST (USD)",null,"TOTAL TIME (HRS)"]
[null,null,null,null,"NEMA","TSS","NEMA","TSS","NEMA","TSS",null,null,"NEMA","TSS","NEMA","TSS","NEMA","TSS","NEMA","TSS","NEMA","TSS","NEMA","TSS","NEMA","TSS",null,null,null,"NEMA","TSS","NEMA","TSS"]
[null,"12-FEET","5ft",null,{"$f":"'VE2'!L310","v":0},{"$f":"TSS!L310","v":0},{"$f":"'VE2'!M310","v":0},{"$f":"TSS!M310","v":0},{"$f":"'VE2'!N310","v":0},{"$f":"TSS!N310","v":0},null,null,{"$f":"'VE2'!O310","v":0},{"$f":"TSS!O310","v":0},{"$f":"'VE2'!P310","v":0},{"$f":"TSS!P310","v":0},{"$f":"'VE2'!Q310","v":0},{"$f":"TSS!Q310","v":0},{"$f":"'VE2'!R310","v":0},{"$f":"TSS!R310","v":0},{"$f":"'VE2'!T310","v":0},{"$f":"TSS!T310","v":0},{"$f":"'VE2'!U310","v":0},{"$f":"TSS!U310","v":0},{"$f":"'VE2'!V310","v":0},{"$f":"TSS!V310","v":0},"(−)   58%",null,null,121308.11908333332,76076.741666666654,1881.5832333333333,1236.7666666666667]
[null,null,"6ft",null,{"$f":"'VE2'!L311","v":0},{"$f":"TSS!L311","v":0},{"$f":"'VE2'!M311","v":0},{"$f":"TSS!M311","v":0},{"$f":"'VE2'!N311","v":0},{"$f":"TSS!N311","v":0},null,null,{"$f":"'VE2'!O311","v":0},{"$f":"TSS!O311","v":0},{"$f":"'VE2'!P311","v":0},{"$f":"TSS!P311","v":0},{"$f":"'VE2'!Q311","v":0},{"$f":"TSS!Q311","v":0},{"$f":"'VE2'!R311","v":0},{"$f":"TSS!R311","v":0},{"$f":"'VE2'!T311","v":0},{"$f":"TSS!T311","v":0},{"$f":"'VE2'!U311","v":0},{"$f":"TSS!U311","v":0},{"$f":"'VE2'!V311","v":0},{"$f":"TSS!V311","v":0},"(−)   50%",null,null,"TSS SAVING:",45231.37741666667,"TSS SAVING:",644.81656666666663]
[null,null,"7ft",null,{"$f":"'VE2'!L312","v":0},{"$f":"TSS!L312","v":0},{"$f":"'VE2'!M312","v":0},{"$f":"TSS!M312","v":0},{"$f":"'VE2'!N312","v":0},{"$f":"TSS!N312","v":0},null,null,{"$f":"'VE2'!O312","v":0},{"$f":"TSS!O312","v":0},{"$f":"'VE2'!P312","v":0},{"$f":"TSS!P312","v":0},{"$f":"'VE2'!Q312","v":0},{"$f":"TSS!Q312","v":0},{"$f":"'VE2'!R312","v":0},{"$f":"TSS!R312","v":0},{"$f":"'VE2'!T312","v":0},{"$f":"TSS!T312","v":0},{"$f":"'VE2'!U312","v":0},{"$f":"TSS!U312","v":0},{"$f":"'VE2'!V312","v":0},{"$f":"TSS!V312","v":0},"(−)   41%"]
[null,null,"8ft",null,{"$f":"'VE2'!L313","v":0},{"$f":"TSS!L313","v":0},{"$f":"'VE2'!M313","v":0},{"$f":"TSS!M313","v":0},{"$f":"'VE2'!N313","v":0},{"$f":"TSS!N313","v":0},null,null,{"$f":"'VE2'!O313","v":0},{"$f":"TSS!O313","v":0},{"$f":"'VE2'!P313","v":0},{"$f":"TSS!P313","v":0},{"$f":"'VE2'!Q313","v":0},{"$f":"TSS!Q313","v":0},{"$f":"'VE2'!R313","v":0},{"$f":"TSS!R313","v":0},{"$f":"'VE2'!T313","v":0},{"$f":"TSS!T313","v":0},{"$f":"'VE2'!U313","v":0},{"$f":"TSS!U313","v":0},{"$f":"'VE2'!V313","v":0},{"$f":"TSS!V313","v":0},"(−)   33%"]
[null,null,"10ft",null,{"$f":"'VE2'!L314","v":0},{"$f":"TSS!L314","v":0},{"$f":"'VE2'!M314","v":0},{"$f":"TSS!M314","v":0},{"$f":"'VE2'!N314","v":0},{"$f":"TSS!N314","v":0},null,null,{"$f":"'VE2'!O314","v":0},{"$f":"TSS!O314","v":0},{"$f":"'VE2'!P314","v":0},{"$f":"TSS!P314","v":0},{"$f":"'VE2'!Q314","v":0},{"$f":"TSS!Q314","v":0},{"$f":"'VE2'!R314","v":0},{"$f":"TSS!R314","v":0},{"$f":"'VE2'!T314","v":0},{"$f":"TSS!T314","v":0},{"$f":"'VE2'!U314","v":0},{"$f":"TSS!U314","v":0},{"$f":"'VE2'!V314","v":0},{"$f":"TSS!V314","v":0},"(−)   16%"]
[null,null,"12ft",null,{"$f":"'VE2'!L315","v":0},{"$f":"TSS!L315","v":0},{"$f":"'VE2'!M315","v":0},{"$f":"TSS!M315","v":0},{"$f":"'VE2'!N315","v":0},{"$f":"TSS!N315","v":0},null,null,{"$f":"'VE2'!O315","v":0},{"$f":"TSS!O315","v":0},{"$f":"'VE2'!P315","v":0},{"$f":"TSS!P315","v":0},{"$f":"'VE2'!Q315","v":0},{"$f":"TSS!Q315","v":0},{"$f":"'VE2'!R315","v":0},{"$f":"TSS!R315","v":0},{"$f":"'VE2'!T315","v":0},{"$f":"TSS!T315","v":0},{"$f":"'VE2'!U315","v":0},{"$f":"TSS!U315","v":0},{"$f":"'VE2'!V315","v":0},{"$f":"TSS!V315","v":0},"(+) 100%"]
[]
[null,"Span Optimization"]
[null,"OPTIMIZED SPANS ",null,null,"20FT STRAIGHT SECTIONS NEMA 20C",null,null,null,null,null,null,null,null,null,null,null,null,null,null,null,null,null,null,null,null,null,null,null,null,null,null,null,null,null,null,null,null,null,null,null,null,null,null,"Total Project Pie Chart (Hours)","Design","Structure\nInstallation","Tray\nInstallation","Total","Delta"]
[null,"STRAIGHT SECTION","SPAN",null,"Support Quantity (PCS)",null,"Support Weight (LBS)",null,"Support Cost (USD)",null,null,null,"Support Instal Time (HRS)",null,"Splice Quantity (PRS)",null,"Clamp Quantity (PRS)",null,"Guide Quantity (PRS)",null,"Hardware Quantity (PCS)",null,"Tray Installation Time (HRS)",null,"Tray Installation Cost (USD)",null,"OPTIMIZATION FACTOR",null,null,null,null,null,null,null,null,null,null,null,null,null,null,null,null,"NEMA",{"$f":"Summary!L98","v":25.0625},{"$f":"Summary!L108","v":29.75},{"$f":"Summary!L118","v":13.952775000000001},{"$f":"SUM(AS49:AU49)","v":68.765275000000003},{"$f":"AV49-AV50","v":34.586108333333335}]
[null,null,null,null,"NEMA","TSS","NEMA","TSS","NEMA","TSS",null,null,"NEMA","TSS","NEMA","TSS","NEMA","TSS","NEMA","TSS","NEMA","TSS","NEMA","TSS","NEMA","TSS",null,null,null,null,null,null,null,null,null,null,null,null,null,null,null,null,null,"TSS",{"$f":"Summary!L97","v":14.0625},{"$f":"Summary!L107","v":17.75},{"$f":"Summary!L117","v":2.3666666666666667},{"$f":"SUM(AS50:AU50)","v":34.179166666666667}]
[null,"20-FEET","10ft",null,{"$f":"'VE2'!L299","v":195},{"$f":"TSS!L299","v":195},{"$f":"'VE2'!M299","v":741},{"$f":"TSS!M299","v":741},{"$f":"'VE2'!N299","v":5742.75},{"$f":"TSS!N299","v":5742.75},null,null,{"$f":"'VE2'!O299","v":22.5},{"$f":"TSS!O299","v":22.5},{"$f":"'VE2'!P299","v":45},{"$f":"TSS!P299","v":0},{"$f":"'VE2'!Q299","v":29.996999999999996},{"$f":"TSS!Q299","v":32},{"$f":"'VE2'!R299","v":69.992999999999995},{"$f":"TSS!R299","v":72},{"$f":"'VE2'!T299","v":1127.9880000000001},{"$f":"TSS!T299","v":776},{"$f":"'VE2'!U299","v":0.18055000000000002},{"$f":"TSS!U299","v":8.2777777777777783E-2},{"$f":"'VE2'!V299","v":13.541250000000002},{"$f":"TSS!V299","v":6.2083333333333339},"(−)   50%",null,null,null,null,null,null,null,null,null,null,null,null,null,null,null,null,"% Saved",{"$f":"IFERROR(AV49/AV50-1,\"NA\")","v":1.0119061319029625},{"$f":"IFERROR(AT49/AT50-1,\"NA\")","v":0.676056338028169},{"$f":"IFERROR(AU49/AU50-1,\"NA\")","v":4.8955387323943667},{"$f":"IFERROR(#REF!/#REF!-1,\"NA\")","v":"NA"}]
[null,null,"12ft",null,{"$f":"'VE2'!L300","v":175.5},{"$f":"TSS!L300","v":156},{"$f":"'VE2'!M300","v":666.9},{"$f":"TSS!M300","v":592.80000000000007},{"$f":"'VE2'!N300","v":5168.4750000000004},{"$f":"TSS!N300","v":4594.2},null,null,{"$f":"'VE2'!O300","v":20.25},{"$f":"TSS!O300","v":18},{"$f":"'VE2'!P300","v":45},{"$f":"TSS!P300","v":0},{"$f":"'VE2'!Q300","v":26.997299999999996},{"$f":"TSS!Q300","v":25.6},{"$f":"'VE2'!R300","v":62.993699999999997},{"$f":"TSS!R300","v":57.6},{"$f":"'VE2'!T300","v":1087.1892},{"$f":"TSS!T300","v":692.8},{"$f":"'VE2'!U300","v":0.16249500000000003},{"$f":"TSS!U300","v":6.6222222222222224E-2},{"$f":"'VE2'!V300","v":12.187125000000002},{"$f":"TSS!V300","v":4.9666666666666668},"(−)   37%"]
[null,null,"14ft",null,{"$f":"'VE2'!L301","v":156},{"$f":"TSS!L301","v":136.5},{"$f":"'VE2'!M301","v":592.80000000000007},{"$f":"TSS!M301","v":518.69999999999993},{"$f":"'VE2'!N301","v":4594.2},{"$f":"TSS!N301","v":4019.9249999999997},null,null,{"$f":"'VE2'!O301","v":18},{"$f":"TSS!O301","v":15.749999999999998},{"$f":"'VE2'!P301","v":45},{"$f":"TSS!P301","v":0},{"$f":"'VE2'!Q301","v":23.997599999999998},{"$f":"TSS!Q301","v":22.4},{"$f":"'VE2'!R301","v":55.994399999999999},{"$f":"TSS!R301","v":50.4},{"$f":"'VE2'!T301","v":1046.3904},{"$f":"TSS!T301","v":651.20000000000005},{"$f":"'VE2'!U301","v":0.14444000000000001},{"$f":"TSS!U301","v":5.7944444444444444E-2},{"$f":"'VE2'!V301","v":10.833},{"$f":"TSS!V301","v":4.3458333333333332},"(−)   28%",null,null,null,null,null,null,null,null,null,null,null,null,null,null,null,null,"Total Project Pie Chart (Cost)","Design\nCost","Structure\nCosts","Tray Install\nCosts","Total","Delta"]
[null,null,"16ft",null,{"$f":"'VE2'!L302","v":136.5},{"$f":"TSS!L302","v":121.875},{"$f":"'VE2'!M302","v":518.69999999999993},{"$f":"TSS!M302","v":463.125},{"$f":"'VE2'!N302","v":4019.9249999999997},{"$f":"TSS!N302","v":3589.21875},null,null,{"$f":"'VE2'!O302","v":15.749999999999998},{"$f":"TSS!O302","v":14.0625},{"$f":"'VE2'!P302","v":45},{"$f":"TSS!P302","v":0},{"$f":"'VE2'!Q302","v":20.997899999999998},{"$f":"TSS!Q302","v":20},{"$f":"'VE2'!R302","v":48.995099999999994},{"$f":"TSS!R302","v":45},{"$f":"'VE2'!T302","v":1005.5916},{"$f":"TSS!T302","v":620},{"$f":"'VE2'!U302","v":0.126385},{"$f":"TSS!U302","v":5.1736111111111115E-2},{"$f":"'VE2'!V302","v":9.4788750000000004},{"$f":"TSS!V302","v":3.8802083333333335},"(−)   20%",null,null,null,null,null,null,null,null,null,null,null,null,null,null,null,null,"NEMA",{"$f":"Summary!M98","v":1879.6875},{"$f":"Summary!M108+Summary!M128","v":9324.57},{"$f":"Summary!M118+Summary!M143+Summary!M153","v":3477.4256250000003},{"$f":"SUM(AS54:AU54)","v":14681.683125},{"$f":"AV54-AV55","v":11040.945625}]
[null,null,"18ft",null,{"$f":"'VE2'!L303","v":117},{"$f":"TSS!L303","v":107.25000000000001},{"$f":"'VE2'!M303","v":444.59999999999997},{"$f":"TSS!M303","v":407.55},{"$f":"'VE2'!N303","v":3445.65},{"$f":"TSS!N303","v":3158.5125000000003},null,null,{"$f":"'VE2'!O303","v":13.5},{"$f":"TSS!O303","v":12.375000000000002},{"$f":"'VE2'!P303","v":45},{"$f":"TSS!P303","v":0},{"$f":"'VE2'!Q303","v":17.998199999999997},{"$f":"TSS!Q303","v":17.600000000000001},{"$f":"'VE2'!R303","v":41.995799999999996},{"$f":"TSS!R303","v":39.6},{"$f":"'VE2'!T303","v":964.79279999999994},{"$f":"TSS!T303","v":588.79999999999995},{"$f":"'VE2'!U303","v":0.10833000000000001},{"$f":"TSS!U303","v":4.5527777777777785E-2},{"$f":"'VE2'!V303","v":8.1247500000000006},{"$f":"TSS!V303","v":3.4145833333333337},"(−)     9%",null,null,null,null,null,null,null,null,null,null,null,null,null,null,null,null,"TSS",{"$f":"Summary!M97","v":1054.6875},{"$f":"Summary!M107+Summary!M127","v":1778.55},{"$f":"Summary!M117+Summary!M142+Summary!M152","v":807.5},{"$f":"SUM(AS55:AU55)","v":3640.7375000000002}]
[null,null,"20ft",null,{"$f":"'VE2'!L304","v":97.5},{"$f":"TSS!L304","v":97.5},{"$f":"'VE2'!M304","v":370.5},{"$f":"TSS!M304","v":370.5},{"$f":"'VE2'!N304","v":2871.375},{"$f":"TSS!N304","v":2871.375},null,null,{"$f":"'VE2'!O304","v":11.25},{"$f":"TSS!O304","v":11.25},{"$f":"'VE2'!P304","v":45},{"$f":"TSS!P304","v":0},{"$f":"'VE2'!Q304","v":14.998499999999998},{"$f":"TSS!Q304","v":16},{"$f":"'VE2'!R304","v":34.996499999999997},{"$f":"TSS!R304","v":36},{"$f":"'VE2'!T304","v":923.99400000000003},{"$f":"TSS!T304","v":568},{"$f":"'VE2'!U304","v":9.0275000000000008E-2},{"$f":"TSS!U304","v":4.1388888888888892E-2},{"$f":"'VE2'!V304","v":6.7706250000000008},{"$f":"TSS!V304","v":3.104166666666667},"(+) 100%",null,null,null,null,null,null,null,null,null,null,null,null,null,null,null,null,"% Saved",{"$f":"IFERROR(AV54/AV55-1,\"NA\")","v":3.0326123827933209},{"$f":"IFERROR(AT54/AT55-1,\"NA\")","v":4.242793286666104},{"$f":"IFERROR(AU54/AU55-1,\"NA\")","v":3.3064094427244584},{"$f":"IFERROR(#REF!/#REF!-1,\"NA\")","v":"NA"}]
[]
[null,null,null,null,null,null,null,null,null,null,null,null,null,null,null,null,null,null,null,null,null,null,null,null,null,null,null,null,null,null,null,null,null,null,null,null,null,null,null,null,null,null,null,"Installation Pieces","Clamps","Guides","Splices","Hardware","Delta"]
[null,null,null,null,null,null,null,null,null,null,null,null,null,null,null,null,null,null,null,null,null,null,null,null,null,null,null,null,null,null,null,null,null,null,null,null,null,null,null,null,null,null,null,"NEMA",{"$f":"IF(ProjectData!$E$13=\"Single Strut (12G)\",Tables!AA32,IF(ProjectData!$E$13=\"Double Strut (12G)\",Tables!AA32,Tables!AA23))","v":59.9985},{"$f":"IF(ProjectData!$E$13=\"Single Strut (12G)\",Tables!AC32,IF(ProjectData!$E$13=\"Double Strut (12G)\",Tables!AC32,Tables!AC23))","v":64.996499999999997},{"$f":"IF(ProjectData!$E$13=\"Single Strut (12G)\",Tables!AE32,IF(ProjectData!$E$13=\"Double Strut (12G)\",Tables!AE32,Tables!AE23))","v":98},{"$f":"IF(ProjectData!$E$13=\"Single Strut (12G)\",Tables!AG32,IF(ProjectData!$E$13=\"Double Strut (12G)\",Tables!AG32,Tables!AG23))","v":2071.9939999999997},{"$f":"AV59-AV60","v":1831.9939999999997}]
[null,null,null,null,null,null,null,null,null,null,null,null,null,null,null,null,null,null,null,null,null,null,null,null,null,null,null,null,null,null,null,null,null,null,null,null,null,null,null,null,null,null,null,"TSS",{"$f":"IF(ProjectData!$E$13=\"Single Strut (12G)\",Tables!AB32,IF(ProjectData!$E$13=\"Double Strut (12G)\",Tables!AB32,Tables!AB23))","v":0},{"$f":"IF(ProjectData!$E$13=\"Single Strut (12G)\",Tables!AD32,IF(ProjectData!$E$13=\"Double Strut (12G)\",Tables!AD32,Tables!AD23))","v":0},{"$f":"IF(ProjectData!$E$13=\"Single Strut (12G)\",Tables!AF32,IF(ProjectData!$E$13=\"Double Strut (12G)\",Tables!AF32,Tables!AF23))","v":15},{"$f":"IF(ProjectData!$E$13=\"Single Strut (12G)\",Tables!AH32,IF(ProjectData!$E$13=\"Double Strut (12G)\",Tables!AH32,Tables!AH23))","v":240}]
[null,null,null,null,null,null,null,null,null,null,null,null,null,null,null,null,null,null,null,null,null,null,null,null,null,null,null,null,null,null,null,null,null,null,null,null,null,null,null,null,null,null,null,"Pieces Saved",{"$f":"AS59-AS60","v":59.9985},{"$f":"AT59-AT60","v":64.996499999999997},{"$f":"AU59-AU60","v":83},{"$f":"AV59-AV60","v":1831.9939999999997}]
[]
[null,null,null,null,null,null,null,null,null,null,null,null,null,null,null,null,null,null,null,null,null,null,null,null,null,null,null,null,null,null,null,null,null,null,null,null,null,null,null,null,null,null,null,"Accessory Installation Hours","Clamps","Guides","Splices","Hardware","Delta"]
[null,null,null,null,null,null,null,null,null,null,null,null,null,null,null,null,null,null,null,null,null,null,null,null,null,null,null,null,null,null,null,null,null,null,null,null,null,null,null,null,null,null,null,"NEMA",{"$f":"IF(ProjectData!$E$13=\"Single Strut (12G)\",Tables!AQ32,IF(ProjectData!$E$13=\"Double Strut (12G)\",Tables!AQ32,Tables!AQ23))","v":1.9999500000000001},{"$f":"IF(ProjectData!$E$13=\"Single Strut (12G)\",Tables!AS32,IF(ProjectData!$E$13=\"Double Strut (12G)\",Tables!AS32,Tables!AS23))","v":2.16655},{"$f":"IF(ProjectData!$E$13=\"Single Strut (12G)\",Tables!AU32,IF(ProjectData!$E$13=\"Double Strut (12G)\",Tables!AU32,Tables!AU23))","v":8.4166666666666679},{"$f":"(AV59*10)/60/60","v":5.7555388888888874},{"$f":"SUM(AS64:AV64)","v":18.338705555555556}]
[null,null,null,null,null,null,null,null,null,null,null,null,null,null,null,null,null,null,null,null,null,null,null,null,null,null,null,null,null,null,null,null,null,null,null,null,null,null,null,null,null,null,null,"TSS",{"$f":"IF(ProjectData!$E$13=\"Single Strut (12G)\",Tables!AR32,IF(ProjectData!$E$13=\"Double Strut (12G)\",Tables!AR32,Tables!AR23))","v":0},{"$f":"IF(ProjectData!$E$13=\"Single Strut (12G)\",Tables!AT32,IF(ProjectData!$E$13=\"Double Strut (12G)\",Tables!AT32,Tables!AT23))","v":0},{"$f":"IF(ProjectData!$E$13=\"Single Strut (12G)\",Tables!AV32,IF(ProjectData!$E$13=\"Double Strut (12G)\",Tables!AV32,Tables!AV23))","v":1.65},{"$f":"(AV60*10)/60/60","v":0.66666666666666663},{"$f":"SUM(AS65:AV65)","v":2.3166666666666664}]
[null,null,null,null,null,null,null,null,null,null,null,null,null,null,null,null,null,null,null,null,null,null,null,null,null,null,null,null,null,null,null,null,null,null,null,null,null,null,null,null,null,null,null,"% Saved",{"$f":"IFERROR(AS64/AS65-1,1000%)","v":10},{"$f":"IFERROR(AT64/AT65-1,1000%)","v":10},{"$f":"IFERROR(AU64/AU65-1,1000%)","v":4.1010101010101021},{"$f":"IFERROR(AV64/AV65-1,1000%)","v":7.633308333333332},{"$f":"IFERROR(AW64/AW65-1,1000%)","v":6.9159880095923274}]
[null,null,null,null,null,null,null,null,null,null,null,null,null,null,null,null,null,null,null,null,null,null,null,null,null,null,null,null,null,null,null,null,null,null,null,null,null,null,null,null,null,null,null,"Hours Saved",{"$f":"AS64-AS65","v":1.9999500000000001},{"$f":"AT64-AT65","v":2.16655},{"$f":"AU64-AU65","v":6.7666666666666675},{"$f":"AV64-AV65","v":5.0888722222222205},{"$f":"AW64-AW65","v":16.02203888888889}]
[]
[null,null,null,null,null,null,null,null,null,null,null,null,null,null,null,null,null,null,null,null,null,null,null,null,null,null,null,null,null,null,null,null,null,null,null,null,null,null,null,null,null,null,null,"Covers","Hardware","Cover Clamps","Clamp Cost"]
[null,null,null,null,null,null,null,null,null,null,null,null,null,null,null,null,null,null,null,null,null,null,null,null,null,null,null,null,null,null,null,null,null,null,null,null,null,null,null,null,null,null,null,"NEMA",{"$f":"IF(BS23=0,\"N/A\",BS23)","v":"N/A"},{"$f":"IF(BQ23=0,\"N/A\",BT23)","v":"N/A"},{"$f":"IF(BQ24=0,\"N/A\",BQ24)","v":"N/A"}]
[null,null,null,null,null,null,null,null,null,null,null,null,null,null,null,null,null,null,null,null,null,null,null,null,null,null,null,null,null,null,null,null,null,null,null,null,null,null,null,null,null,null,null,"TSS",{"$f":"IF(BT23=0,\"N/A\",BT23)","v":"N/A"},{"$f":"IF(AT70=\"N/A\",\"N/A\",BR23)","v":"N/A"},{"$f":"IF(AU70=\"N/A\",\"N/A\",BR24)","v":"N/A"}]
[null,null,null,null,null,null,null,null,null,null,null,null,null,null,null,null,null,null,null,null,null,null,null,null,null,null,null,null,null,null,null,null,null,null,null,null,null,null,null,null,null,null,null,"% Saved",{"$f":"IFERROR(IF(AS70=\"N/A\",\"N/A\",(AS70/AS71-1)),1000%)","v":"N/A"},{"$f":"IFERROR(IF(AT70=\"N/A\",\"N/A\",(AT70/AT71-1)),1000%)","v":"N/A"},{"$f":"IFERROR(IF(AU70=\"N/A\",\"N/A\",(AU70/AU71-1)),1000%)","v":"N/A"}]
[null,null,null,null,null,null,null,null,null,null,null,null,null,null,null,null,null,null,null,null,null,null,null,null,null,null,null,null,null,null,null,null,null,null,null,null,null,null,null,null,null,null,null,"Costing & QTY",{"$f":"IFERROR(IF(AS72=\"N/A\",\"N/A\",AS70-AS71),1000%)","v":"N/A"},{"$f":"IFERROR(IF(AT72=\"N/A\",\"N/A\",AT70-AT71),1000%)","v":"N/A"},{"$f":"IF(AU72=\"N/A\",\"N/A\",AU70-AU71)","v":"N/A"}]
[]
[null,null,null,null,null,null,null,null,null,null,null,null,null,null,null,null,null,null,null,null,null,null,null,null,null,null,null,null,null,null,null,null,null,null,null,null,null,null,null,null,null,null,null,"Supports","QTY","Cost"]
[null,null,null,null,null,null,null,null,null,null,null,null,null,null,null,null,null,null,null,null,null,null,null,null,null,null,null,null,null,null,null,null,null,null,null,null,null,null,null,null,null,null,null,"NEMA",{"$f":"E23","v":119},{"$f":"IF(ProjectData!$E$13=\"Single Strut (12G)\",Tables!I32,IF(ProjectData!$E$13=\"Double Strut (12G)\",Tables!I32,Tables!I23))","v":7093.32}]
[null,null,null,null,null,null,null,null,null,null,null,null,null,null,null,null,null,null,null,null,null,null,null,null,null,null,null,null,null,null,null,null,null,null,null,null,null,null,null,null,null,null,null,"TSS",{"$f":"F23","v":71},{"$f":"IF(ProjectData!$E$13=\"Single Strut (12G)\",Tables!J32,IF(ProjectData!$E$13=\"Double Strut (12G)\",Tables!J32,Tables!J23))","v":447.3}]
[null,null,null,null,null,null,null,null,null,null,null,null,null,null,null,null,null,null,null,null,null,null,null,null,null,null,null,null,null,null,null,null,null,null,null,null,null,null,null,null,null,null,null,"% Saved",{"$f":"IFERROR(AS76/AS77-1,1000%)","v":0.676056338028169},{"$f":"IFERROR(AT76/AT77-1,1000%)","v":14.858081824279006}]
[null,null,null,null,null,null,null,null,null,null,null,null,null,null,null,null,null,null,null,null,null,null,null,null,null,null,null,null,null,null,null,null,null,null,null,null,null,null,null,null,null,null,null,"Savings",{"$f":"AS76-AS77","v":48},{"$f":"AT76-AT77","v":6646.0199999999995}]
[]
[null,null,null,null,null,null,null,null,null,null,null,null,null,null,null,null,null,null,null,null,null,null,null,null,null,null,null,null,null,null,null,null,null,null,null,null,null,null,null,null,null,null,null,"Expansion Cartridge","Additional Splices (PR)","Supports","Guides (PR)","Hardware","Cost","Hours"]
[null,null,null,null,null,null,null,null,null,null,null,null,null,null,null,null,null,null,null,null,null,null,null,null,null,null,null,null,null,null,null,null,null,null,null,null,null,null,null,null,null,null,null,"NEMA",{"$f":"'VE2'!Z171+'VE2'!Z182","v":15},{"$f":"AS82*2","v":30},{"$f":"'VE2'!AD171+'VE2'!AD182","v":30},{"$f":"'VE2'!AA182+'VE2'!AA171+'VE2'!AE171+'VE2'!AE182","v":360},{"$f":"'VE2'!O171+'VE2'!O182+'VE2'!AI171+'VE2'!AI182+'VE2'!AO171+'VE2'!AO182","v":3472.75},{"$f":"'VE2'!W171+'VE2'!W182+'VE2'!X171+'VE2'!AK171+'VE2'!AK182+'VE2'!AM171+'VE2'!AM182","v":17.5}]
[null,null,null,null,null,null,null,null,null,null,null,null,null,null,null,null,null,null,null,null,null,null,null,null,null,null,null,null,null,null,null,null,null,null,null,null,null,null,null,null,null,null,null,"TSS",0,{"$f":"AS83*2","v":0},{"$f":"TSS!AD171+TSS!AD182","v":0},{"$f":"TSS!AA182+TSS!AA171+TSS!AE171+TSS!AE182","v":60},{"$f":"TSS!O171+TSS!O182+TSS!AI171+TSS!AI182+TSS!AO171+TSS!AO182","v":470},{"$f":"TSS!W171+TSS!W182+TSS!X171+TSS!AK171+TSS!AK182+TSS!AM171+TSS!AM182","v":0.26666666666666666}]
[null,null,null,null,null,null,null,null,null,null,null,null,null,null,null,null,null,null,null,null,null,null,null,null,null,null,null,null,null,null,null,null,null,null,null,null,null,null,null,null,null,null,null,"% Saved",{"$f":"IFERROR(AS82/AS83-1,1000%)","v":10},{"$f":"IFERROR(AT82/AT83-1,1000%)","v":10},{"$f":"IFERROR(AU82/AU83-1,1000%)","v":10},{"$f":"IFERROR(AV82/AV83-1,1000%)","v":5},{"$f":"IFERROR(AW82/AW83-1,1000%)","v":6.3888297872340427},64.625]
[null,null,null,null,null,null,null,null,null,null,null,null,null,null,null,null,null,null,null,null,null,null,null,null,null,null,null,null,null,null,null,null,null,null,null,null,null,null,null,null,null,null,null,"Savings",{"$f":"AS82-AS83","v":15},{"$f":"AT82-AT83","v":30},30,300,3002.75,17.233333333333334]
[]
[]
[]
[]
[null,null,null,null,null,null,null,null,null,null,null,null,null,null,null,null,null,null,null,null,null,null,null,null,null,null,null,null,null,null,null,null,null,null,null,null,null,null,null,null,null,null,null,"TSS Overview Vs NEMA","Design\nHours","Structure\nInstallation Hours","Tray\nInstallation Hours","Support\nQTY","Clamps \nQTY","Guides\nQTY","Splice\nQTY","Hardware\nQTY","Cover\nHardware QTY","Cover\nClamp QTY","Clamp\nCost","Design\nCost","Structure\nCosts","Tray\nCosts"]
[null,null,null,null,null,null,null,null,null,null,null,null,null,null,null,null,null,null,null,null,null,null,null,null,null,null,null,null,null,null,null,null,null,null,null,null,null,null,null,null,null,null,null,"NEMA",{"$f":"AS49","v":25.0625},29.75,13.952775000000001,{"$f":"AS76","v":119},{"$f":"AS59","v":59.9985},64.996499999999997,98,2071.9939999999997,{"$f":"AS70","v":"N/A"},"N/A","N/A",{"$f":"AS54","v":1879.6875},9324.57,3477.4256250000003]
[null,null,null,null,null,null,null,null,null,null,null,null,null,null,null,null,null,null,null,null,null,null,null,null,null,null,null,null,null,null,null,null,null,null,null,null,null,null,null,null,null,null,null,"TSS",14.0625,17.75,2.3666666666666667,{"$f":"AS77","v":71},0,0,15,240,"N/A","N/A","N/A",1054.6875,1778.55,807.5]
[null,null,null,null,null,null,null,null,null,null,null,null,null,null,null,null,null,null,null,null,null,null,null,null,null,null,null,null,null,null,null,null,null,null,null,null,null,null,null,null,null,null,null,"% Saved",{"$f":"IFERROR(AS91/AS92-1,1000%)","v":0.78222222222222215},{"$f":"IFERROR(AT91/AT92-1,1000%)","v":0.676056338028169},4.8955387323943667,{"$f":"IFERROR(AV91/AV92-1,1000%)","v":0.676056338028169},10,10,5.5333333333333332,7.633308333333332,10,10,10,0.78222222222222215,4.242793286666104,3.3064094427244584]

{"sheet":"CTI Input Sheet","index":4,"n_rows":28,"n_cols":19,"rows_kept":28,"cut":false,"hidden":true,"merged":[]}
[null,null,null,"  CTI INPUTS : TOUGH Support Savings Calculator"]
[]
[null,"Support Structure Section Costs*",null,null,null,null,"Skilled Labor Rates* ",null,null,"Installation Times* ",null,null,"NEMA VE-2 Cover Clamp Costs & Installation Times & Weights"]
[null,"Type","Section Weight LB/FT","Support Instal Time MIN/PC","Section Cost USD/FT",null,"Skilled Worker Discipline","Worker Rates (USD/HR) ",null,"Cable Tray Accessory Item","Instal Time (MIN/ITEM)",null,"Cover Clamp Width","4\" Height Cost (Ea/USD)","6\" Height Cost (Ea/USD)","Installation Time (MIN)","4\" High Clamp Weight (LBS)","6\" High Clamp Weight (LBS)"]
[null,"Single Strut (12G)",1.9,15,2.85,null,"Cable Tray Installer",{"$f":"ProjectData!C14","v":75},null,"Splice Plate (PR)",5,null,"6\" Width",{"$f":"O5*0.95","v":12.824999999999999},13.5,1,0.61,0.69]
[null,"Double Strut (12G)",3.8,15,5.7,null,"Structural Steel Erector",{"$f":"ProjectData!C15","v":75},null,"TOUGHLink (PR)",1,null,"9\" Width",14.725,15.5,1,0.74,0.82]
[null,"C-Channel (C6x13)",13,45,19.5,null,"Structural Design Engineer",{"$f":"ProjectData!C16","v":75},null,"Hold Down Clamps (PR)",2,null,"12\" Width",17.099999999999998,18,1,0.87,0.95]
[null,"I-Beam (S8x23)",23,60,{"$f":"1.5*C8","v":34.5},null,null,null,null,"Expansion Guides (PR)",2,null,"18\" Width",19.95,21,1.25,1.1200000000000001,1.2]
[null,"I-Beam (S12x50)",50,60,{"$f":"1.5*C9","v":75},null,null,null,null,"Expansion Splice Plate (PR)",6,null,"24\" Width",23.75,25,1.25,1.34,1.46]
[null,"ATR (1/2\"x12\")",0.21,5,2.52,null,"Logistic Rates*",null,null,"4\" Expansion Cartridge (PR)",1,null,"30\" Width",25.65,27,1.5,1.63,1.72]
[null,null,null,null,null,null,"Logistic Type","Allocated Cost",null,"6\" Expansion Cartridge (PR)",1,null,"36\" Width",{"$f":"O11*0.95","v":26.599999999999998},28,1.5,1.89,1.97]
[null,"Tray Accessory Costs* ",null,null,null,null,"30ft Hot Shot",5500,null,"VE2 Strut Support (EA)",7]
[null,"Cable Tray Accessory","STANDARD Tray Costs","TOUGHTray Costs",null,null,"40ft Flat Bed Truck",8000,null,"TSS Strut ATR Support (EA)",2]
[null,"Hold Down Clamps (PRS)",5,6,null,null,"40ft Ocean Container",10000,null,"Structural Steel Support (EA)",60,null,"TOUGHTray Cover Clamp Costs & Installation Times & Weights"]
[null,"Clamp Hardware  (PCS)",1.25,1.25,null,null,"LTL is not available for tems over 10ft length",null,null,null,null,null,"Cover Clamp Width","Fitting Cover Kit Cost (USD)","Fitting Cover Kit Instal (MIN)","TOUGHTorx Cost (Ea/USD)","Installation Time (MIN)","Fitting Cover Kit Weight (LBS)","TOUGHTorx Weight (LBS)"]
[null,"Expansion Guides (PRS)",5,6,null,null,null,null,null,null,null,null,"6\" Width",1,0.2,1,0.08,0.1,0.02]
[null,"Guide Hardware (PCS)",1.25,1.25,null,null,null,null,null,null,null,null,"9\" Width",1,0.2,1,0.08,0.1,0.02]
[null,"4\" Expansion Splice Plate (PRS)",15,null,null,null,null,null,null,"Supports Design Time*",null,null,"12\" Width",1,0.2,1,0.08,0.1,0.02]
[null,"6\" Expansion Splice Plate (PRS)",20,null,null,null,"Finish Costs Multipliler*",null,null,"Cable Tray Item","Design Time (HR/ITEM)",null,"18\" Width",1,0.2,1,0.08,0.1,0.02]
[null,"4\" Expansion Cartridge (PRS)",null,25,null,null,"Logistic Type","Cost Multiplier Factor",null,"Straight Section",0.25,null,"24\" Width",1,0.2,1,0.08,0.1,0.02]
[null,"6\" Expansion Cartridge (PRS)",null,30,null,null,"Pre-Galv",1,null,"Horizontal Bend",1.5,null,"30\" Width",1,0.2,1,0.08,0.1,0.02]
[null,"Splice Plate Hardware (PCS)",0.75,null,null,null,"HotDip Galv",1.25,null,"Horizontal Tee",2.5,null,"36\" Width",1,0.2,1,0.08,0.1,0.02]
[null,"TOUGHLink Hardware (PCS)",null,1.5,null,null,"Stainless",4,null,"Horizontal Cross",3]
[null,null,null,null,null,null,"Painted",1.25,null,"Vertical Elbows",1.5]
[null,null,null,null,null,null,null,null,null,"Expansion Joint",0.5]
[null,"Support Structure Fabrication & Erection Costs* ",null,null,null,null,null,null,null,"Reducer",1]
[null,"Fabrication Cost USD/LB","Handling Cost USD/LB","Erection Cost USD/LB",null,null,null,null,null,"HADJ Adjustable Joint",1.5]
[null,1.5,0.25,0,null,null,null,null,null,"VADJ Adjustable Joint",1]

{"sheet":"VE2","index":5,"n_rows":332,"n_cols":49,"rows_kept":332,"cut":false,"hidden":true,"merged":[[193,42,193,48],[196,3,196,4],[11,6,11,8],[12,6,12,8],[315,0,315,8],[258,10,258,19],[295,10,295,22],[306,10,306,22],[277,0,277,8],[296,0,296,8],[277,10,277,20],[283,10,283,20],[289,10,289,20],[258,0,258,8],[195,3,195,4],[193,19,193,23],[14,19,14,23],[207,0,207,5],[185,3,185,4],[193,25,193,30],[193,32,193,34],[193,36,193,40],[194,3,194,4],[189,3,189,4],[190,3,190,4],[193,3,193,4],[192,5,192,15],[188,5,188,15],[188,19,188,23],[188,25,188,30],[188,32,188,34],[188,36,188,40],[188,3,188,4],[183,25,183,30],[183,32,183,34],[183,36,183,40],[183,5,183,15],[184,3,184,4],[61,42,61,48],[86,42,86,48],[111,42,111,48],[136,42,136,48],[172,32,172,34],[172,36,172,40],[172,25,172,30],[161,36,161,40],[161,19,161,23],[172,3,172,4],[172,5,172,14],[172,19,172,23],[161,3,161,4],[161,5,161,14],[183,3,183,4],[183,19,183,23],[3,43,3,48],[25,42,25,48],[14,42,14,48],[136,25,136,30],[161,25,161,30],[3,39,3,40],[36,32,36,34],[36,36,36,40],[61,32,61,34],[61,36,61,40],[86,32,86,34],[86,36,86,40],[111,32,111,34],[111,36,111,40],[36,42,36,48],[25,32,25,34],[25,36,25,40],[11,36,11,37],[14,32,14,34],[14,36,14,40],[136,32,136,34],[136,36,136,40],[161,32,161,34],[14,25,14,30],[3,16,3,17],[136,3,136,4],[136,5,136,14],[111,3,111,4],[111,5,111,14],[25,3,25,12],[25,14,25,15],[86,19,86,23],[111,19,111,23],[36,25,36,30],[61,25,61,30],[86,25,86,30],[111,25,111,30],[25,25,25,30],[11,25,11,27],[136,19,136,23],[3,1,10,1],[86,3,86,4],[61,5,61,16],[86,5,86,17],[36,19,36,23],[61,19,61,23],[36,3,36,4],[3,10,3,12],[36,5,36,15],[61,3,61,4],[8,10,8,12],[14,3,14,12],[14,14,14,15],[3,14,3,15],[3,19,3,20],[25,19,25,23],[8,3,8,8]]}
[null,"NEMA VE 2 Structural Support Calculator"]
[]
[null,null,null,null,null,null,null,null,null,null,null,null,null,null,"Expansion Joint Calculation (based on 50% of straight section qty)",null,null,null,null,null,null,null,null,null,null,"Logistic Rates",null,null,null,null,null,null,"Tray Accessory Costs ",null,null,null,"Customer Skilled Labor Rates",null,null,"Tray Installation Times ",null,null,null,"Cover Clamp Costs & Installation Times & Weights"]
[null,null,null,null,null,null,null,null,null,null,null,null,null,null,"4in Expansion Joint Quantities",null,"6in Expansion Joint Quantities",null,null,null,null,null,null,null,null,"Logistic Costs (USD)",null,null,null,null,null,null,"Cable Tray Accessory Costs (USD)",null,null,null,"Project Labor Cost (USD/HOUR)",null,null,"Tray Accessory Installation Time (Minutes)",null,null,null,"Cover Clamp Costs (USD) & Installation Times (MIN) & Weights (LBS)"]
[null,null,null,null,null,null,null,null,null,null,null,null,null,null,"Cable Tray Width (in)","Expansion Splice Qty (PR) ","Cable Tray Width (in)","Expansion Splice Qty (PR) ",null,null,null,null,null,null,null,"Logistic Type","Allocated Cost",null,null,null,null,null,"Cable Tray Accessory","STANDARD Tray Costs",null,null,"Skilled Worker Discipline","Labor Hourly Work Rate ",null,"Cable Tray Accessory","Allocated Installation Time",null,null,"Cover Clamp Width","4\" Height Cost (Ea/USD)","6\" Height Cost (Ea/USD)","Installation Time (MIN)","4\" High Clamp Weight (LBS)","6\" High Clamp Weight (LBS)"]
[null,null,null,null,null,null,null,null,null,null,null,null,null,null,6,{"$f":"ROUNDDOWN(((B17*12)/72),0)","v":0},6,{"$f":"ROUNDDOWN(((B28*20)/60),0)","v":0},null,null,null,null,null,null,null,"30ft HOT SHOT",{"$f":"'CTI Input Sheet'!H12","v":5500},null,null,null,null,null,"4\" Expansion Splice Plates (PR)",{"$f":"'CTI Input Sheet'!C18","v":15},null,null,"Cable Tray Installer",{"$f":"'CTI Input Sheet'!H5","v":75},null,"Splice Plates (PR)",{"$f":"'CTI Input Sheet'!K5","v":5},null,null,"6\" Width",{"$f":"'CTI Input Sheet'!N5","v":12.824999999999999},{"$f":"'CTI Input Sheet'!O5","v":13.5},{"$f":"'CTI Input Sheet'!P5","v":1},{"$f":"'CTI Input Sheet'!Q5","v":0.61},{"$f":"'CTI Input Sheet'!R5","v":0.69}]
[null,null,null,null,null,null,null,null,null,null,null,null,null,null,9,0,9,0,null,null,null,null,null,null,null,"40ft FLAT BED TRUCK",{"$f":"'CTI Input Sheet'!H13","v":8000},null,null,null,null,null,"6\" Expansion Splice Plates (PR)",{"$f":"'CTI Input Sheet'!C19","v":20},null,null,"Structural Steel Erector",{"$f":"'CTI Input Sheet'!H6","v":75},null,"Expansion Splice Plates (PR)",{"$f":"'CTI Input Sheet'!K9","v":6},null,null,"9\" Width",{"$f":"'CTI Input Sheet'!N6","v":14.725},{"$f":"'CTI Input Sheet'!O6","v":15.5},{"$f":"'CTI Input Sheet'!P6","v":1},{"$f":"'CTI Input Sheet'!Q6","v":0.74},{"$f":"'CTI Input Sheet'!R6","v":0.82}]
[null,null,null,"Support Structural Sections",null,null,null,null,null,null,null,null,null,null,12,0,12,10,null,null,null,null,null,null,null,"40ft CONTAINER",{"$f":"'CTI Input Sheet'!H14","v":10000},null,null,null,null,null,"Hold Down Clamps (PR)",{"$f":"'CTI Input Sheet'!C14","v":5},null,null,"Structural Design Engineer",{"$f":"'CTI Input Sheet'!H7","v":75},null,"Hold Down Clamps (PR)",{"$f":"'CTI Input Sheet'!K7","v":2},null,null,"12\" Width",{"$f":"'CTI Input Sheet'!N7","v":17.099999999999998},{"$f":"'CTI Input Sheet'!O7","v":18},{"$f":"'CTI Input Sheet'!P7","v":1},{"$f":"'CTI Input Sheet'!Q7","v":0.87},{"$f":"'CTI Input Sheet'!R7","v":0.95}]
[null,null,null,"Cable Tray Support Structural Section",null,null,null,null,null,null,null,null,null,null,18,0,18,0,null,null,null,null,null,null,null,null,null,null,null,null,null,null,"Clamp Hardware  (PC)",{"$f":"'CTI Input Sheet'!C15","v":1.25},null,null,null,null,null,"Expansion Guides (PR)",{"$f":"'CTI Input Sheet'!K8","v":2},null,null,"18\" Width",{"$f":"'CTI Input Sheet'!N8","v":19.95},{"$f":"'CTI Input Sheet'!O8","v":21},{"$f":"'CTI Input Sheet'!P8","v":1.25},{"$f":"'CTI Input Sheet'!Q8","v":1.1200000000000001},{"$f":"'CTI Input Sheet'!R8","v":1.2}]
[null,null,null,"Type","Type #","Dimension","Section Weight LB/FT","Support Instal Time MIN/PC","Section Cost USD/FT",null,null,null,null,null,24,0,24,0,null,null,null,null,null,null,null,null,null,null,null,null,null,null,"Expansion Guides (PR)",{"$f":"'CTI Input Sheet'!C16","v":5},null,null,null,null,null,"Structural Support (PC)",{"$f":"'CTI Input Sheet'!K14","v":60},null,null,"24\" Width",{"$f":"'CTI Input Sheet'!N9","v":23.75},{"$f":"'CTI Input Sheet'!O9","v":25},{"$f":"'CTI Input Sheet'!P9","v":1.25},{"$f":"'CTI Input Sheet'!Q9","v":1.34},{"$f":"'CTI Input Sheet'!R9","v":1.46}]
[null,null,null,"Straight Section Support",{"$f":"ProjectData!E13","v":"Double Strut (12G)"},null,{"$f":"INDEX('CTI Input Sheet'!C5:C10,MATCH('VE2'!E11,'CTI Input Sheet'!B5:B10,0))","v":3.8},{"$f":"INDEX('CTI Input Sheet'!D5:D10,MATCH('VE2'!E11,'CTI Input Sheet'!B5:B10,0))","v":15},{"$f":"INDEX('CTI Input Sheet'!E5:E10,MATCH('VE2'!E11,'CTI Input Sheet'!B5:B10,0))","v":5.7},null,null,null,null,null,30,0,30,0,null,null,null,null,null,null,null,null,null,null,null,null,null,null,"Guide Hardware (PC)",{"$f":"'CTI Input Sheet'!C17","v":1.25},null,null,null,null,null,"Strut Channel Support (PC)",{"$f":"'CTI Input Sheet'!K12","v":7},null,null,"30\" Width",{"$f":"'CTI Input Sheet'!N10","v":25.65},{"$f":"'CTI Input Sheet'!O10","v":27},{"$f":"'CTI Input Sheet'!P10","v":1.5},{"$f":"'CTI Input Sheet'!Q10","v":1.63},{"$f":"'CTI Input Sheet'!R10","v":1.72}]
[null,null,null,"Support Finish",{"$f":"ProjectData!E17","v":"Stainless"},null,{"$f":"INDEX('CTI Input Sheet'!H21:H24,MATCH('VE2'!E12,'CTI Input Sheet'!G21:G24,0))","v":4},null,null,null,null,null,null,null,36,0,36,5,null,null,null,null,null,null,null,null,null,null,null,null,null,null,"Splice Plate Hardware (PC)",{"$f":"'CTI Input Sheet'!C22","v":0.75},null,null,null,null,null,null,null,null,null,"36\" Width",{"$f":"'CTI Input Sheet'!N11","v":26.599999999999998},{"$f":"'CTI Input Sheet'!O11","v":28},{"$f":"'CTI Input Sheet'!P11","v":1.5},{"$f":"'CTI Input Sheet'!Q11","v":1.89},{"$f":"'CTI Input Sheet'!R11","v":1.97}]
[null,null,null,null,null,null,{"$f":"G12*I11","v":22.8}]
[]
[null,"4in Straight Sections",null,"NEMA VE 2 : 4in Height Straight Section :  Support Structure Quantity - Support Weight - Support Steel Fabrication, Logistics, Erection Costs",null,null,null,null,null,null,null,null,null,null,null,null,null,null,null,"4\" Straight Section : Support Structure Summary",null,null,null,null,null,"4\" Straight Section : Tray Accessory Quantities ",null,null,null,null,null,null,"4\" Straight Section : Tray Accessory Costs ",null,null,null,"Straight Section : Tray Accessory Installation Time & Installation Cost",null,null,null,null,null,"4\" Straight Section Covers"]
[null,"Quantities/Piece",null,"Tray Width (in)","Support Quantity","Section Length (FT)","Total Str. Section Length (FT)","Total Str. Section Weight (lb)","Total Str. Section Cost (USD)","Total Fabrication Cost (USD)","Total Handling Cost (USD)","Total Erection Cost (USD","SUM TOTAL COST/SECTION",null,null,null,null,null,null,"Total Quantity of Supports","Total Weight of Supports (LB)","Total Cost of Supports (USD)","Total Design Time (HRS)","Total Support Instal Time (HRS)",null,"Splice Plates Quantity (PRS)","Splice Plate Hardware Quantity (PCS)","Hold Down Clamp Quantity (PRS)","Clamp Hardware Quantity (PCS)","Expansion Guides Quantity (PRS)","Guides Hardware Quantity (PCS)",null,"Hold Down Clamps (PR)","Expansion Guides (PR)","Total Accessory Cost",null,"Splice Plates Time/Pair (HRS)","Hold Down Clamp Time/Pair (HRS)","Exp. Guide Time/Pair (HRS)","Total Time (HOURS)","Total Time Cost (USD)",null,"Cover Quantity (PCS)","Clamp Quantity (PCS)","Hardware Quantity (PCS)","Cover Weight (LBS)","Clamp Weight (LBS)","Clamps Cost (USD)","Installation Time (HRS)"]
[null,{"$f":"ProjectData!C24","v":0},null,6,1,1,{"$f":"(E17*F17)*B17","v":0},{"$f":"G17*G11","v":0},{"$f":"G17*G13","v":0},{"$f":"H17*'CTI Input Sheet'!B28","v":0},{"$f":"H17*'CTI Input Sheet'!C28","v":0},{"$f":"H17*'CTI Input Sheet'!D28","v":0},{"$f":"SUM(I17:L17)","v":0},null,null,null,null,null,null,{"$f":"B17*E17","v":0},{"$f":"H17","v":0},{"$f":"M17","v":0},{"$f":"T17*'CTI Input Sheet'!K20","v":0},{"$f":"SUM(T17*H11)/60","v":0},null,{"$f":"B17*1","v":0},{"$f":"Z17*16","v":0},{"$f":"SUM(E17)*(B17*0.3333)","v":0},{"$f":"AB17*4","v":0},{"$f":"SUM(E17)*(B17*0.7777)","v":0},{"$f":"EVEN(AD17)*4","v":0},null,{"$f":"SUM(AB17*AH8)+(AC17*AH9)","v":0},{"$f":"SUM(AD17*AH10)+(AE17*AH11)","v":0},{"$f":"SUM(AG17:AH17)","v":0},null,{"$f":"(Z17*AO6)/60","v":0},{"$f":"AB17*AO8/60","v":0},{"$f":"AD17*AO9/60","v":0},{"$f":"SUM(AK17:AM17)","v":0},{"$f":"AN17*AL6","v":0},null,{"$f":"IF(ProjectData!H$17=\"Not Required\",0,B17*2)","v":0},{"$f":"AQ17*3","v":0},{"$f":"AR17*4","v":0},{"$f":"AQ17*2.5","v":0},{"$f":"+AR17*AV6","v":0},{"$f":"AR17*AS6","v":0},{"$f":"AR17*AU6/60","v":0}]
[null,{"$f":"ProjectData!C25","v":0},null,9,1,1.25,0,{"$f":"G18*G11","v":0},{"$f":"G18*G13","v":0},{"$f":"H18*'CTI Input Sheet'!B28","v":0},{"$f":"H18*'CTI Input Sheet'!C28","v":0},{"$f":"H18*'CTI Input Sheet'!D28","v":0},{"$f":"SUM(I18:L18)","v":0},null,null,null,null,null,null,{"$f":"B18*E18","v":0},{"$f":"H18","v":0},0,{"$f":"T18*'CTI Input Sheet'!K20","v":0},{"$f":"SUM(T18*H11)/60","v":0},null,{"$f":"B18*1","v":0},{"$f":"Z18*16","v":0},{"$f":"SUM(E18)*(B18*0.3333)","v":0},{"$f":"AB18*4","v":0},{"$f":"SUM(E18)*(B18*0.7777)","v":0},0,null,{"$f":"SUM(AB18*AH8)+(AC18*AH9)","v":0},{"$f":"SUM(AD18*AH10)+(AE18*AH11)","v":0},{"$f":"SUM(AG18:AH18)","v":0},null,{"$f":"Z18*AO6/60","v":0},{"$f":"AB18*AO8/60","v":0},{"$f":"AD18*AO9/60","v":0},0,{"$f":"AN18*AL6","v":0},null,{"$f":"IF(ProjectData!H$17=\"Not Required\",0,B18*2)","v":0},{"$f":"AQ18*3","v":0},{"$f":"AR18*4","v":0},{"$f":"AQ18*3.37","v":0},{"$f":"+AR18*AV7","v":0},0,0]
[null,{"$f":"ProjectData!C26","v":0},null,12,1,1.5,0,{"$f":"G19*G11","v":0},{"$f":"G19*G13","v":0},{"$f":"H19*'CTI Input Sheet'!B28","v":0},{"$f":"H19*'CTI Input Sheet'!C28","v":0},{"$f":"H19*'CTI Input Sheet'!D28","v":0},0,null,null,null,null,null,null,0,0,0,{"$f":"T19*'CTI Input Sheet'!K20","v":0},{"$f":"SUM(T19*H11)/60","v":0},null,0,0,0,0,0,0,null,{"$f":"SUM(AB19*AH8)+(AC19*AH9)","v":0},{"$f":"SUM(AD19*AH10)+(AE19*AH11)","v":0},0,null,{"$f":"Z19*AO6/60","v":0},{"$f":"AB19*AO8/60","v":0},{"$f":"AD19*AO9/60","v":0},0,{"$f":"AN19*AL6","v":0},null,{"$f":"IF(ProjectData!H$17=\"Not Required\",0,B19*2)","v":0},0,0,{"$f":"AQ19*4.24","v":0},0,0,0]
[null,{"$f":"ProjectData!C27","v":0},null,18,1,2,0,{"$f":"G20*G11","v":0},{"$f":"G20*G13","v":0},{"$f":"H20*'CTI Input Sheet'!B28","v":0},{"$f":"H20*'CTI Input Sheet'!C28","v":0},{"$f":"H20*'CTI Input Sheet'!D28","v":0},0,null,null,null,null,null,null,0,0,0,{"$f":"T20*'CTI Input Sheet'!K20","v":0},{"$f":"SUM(T20*H11)/60","v":0},null,0,0,0,0,0,0,null,{"$f":"SUM(AB20*AH8)+(AC20*AH9)","v":0},{"$f":"SUM(AD20*AH10)+(AE20*AH11)","v":0},0,null,{"$f":"Z20*AO6/60","v":0},{"$f":"AB20*AO8/60","v":0},{"$f":"AD20*AO9/60","v":0},0,{"$f":"AN20*AL6","v":0},null,{"$f":"IF(ProjectData!H$17=\"Not Required\",0,B20*2)","v":0},0,0,{"$f":"AQ20*5.98","v":0},0,0,0]
[null,{"$f":"ProjectData!C28","v":0},null,24,1,2.5,0,{"$f":"G21*G11","v":0},{"$f":"G21*G13","v":0},{"$f":"H21*'CTI Input Sheet'!B28","v":0},{"$f":"H21*'CTI Input Sheet'!C28","v":0},{"$f":"H21*'CTI Input Sheet'!D28","v":0},0,null,null,null,null,null,null,0,0,0,{"$f":"T21*'CTI Input Sheet'!K20","v":0},{"$f":"SUM(T21*H11)/60","v":0},null,0,0,0,0,0,0,null,{"$f":"SUM(AB21*AH8)+(AC21*AH9)","v":0},{"$f":"SUM(AD21*AH10)+(AE21*AH11)","v":0},0,null,{"$f":"Z21*AO6/60","v":0},{"$f":"AB21*AO8/60","v":0},{"$f":"AD21*AO9/60","v":0},0,{"$f":"AN21*AL6","v":0},null,{"$f":"IF(ProjectData!H$17=\"Not Required\",0,B21*2)","v":0},0,0,{"$f":"AQ21*7.73","v":0},0,0,0]
[null,{"$f":"ProjectData!C29","v":0},null,30,1,3,0,{"$f":"G22*G11","v":0},{"$f":"G22*G13","v":0},{"$f":"H22*'CTI Input Sheet'!B28","v":0},{"$f":"H22*'CTI Input Sheet'!C28","v":0},{"$f":"H22*'CTI Input Sheet'!D28","v":0},0,null,null,null,null,null,null,0,0,0,{"$f":"T22*'CTI Input Sheet'!K20","v":0},{"$f":"SUM(T22*H11)/60","v":0},null,0,0,0,0,0,0,null,{"$f":"SUM(AB22*AH8)+(AC22*AH9)","v":0},{"$f":"SUM(AD22*AH10)+(AE22*AH11)","v":0},0,null,{"$f":"Z22*AO6/60","v":0},{"$f":"AB22*AO8/60","v":0},{"$f":"AD22*AO9/60","v":0},0,{"$f":"AN22*AL6","v":0},null,{"$f":"IF(ProjectData!H$17=\"Not Required\",0,B22*2)","v":0},0,0,{"$f":"AQ22*9.48","v":0},0,0,0]
[null,{"$f":"ProjectData!C30","v":0},null,36,1,3.5,0,{"$f":"G23*G11","v":0},{"$f":"G23*G13","v":0},{"$f":"H23*'CTI Input Sheet'!B28","v":0},{"$f":"H23*'CTI Input Sheet'!C28","v":0},{"$f":"H23*'CTI Input Sheet'!D28","v":0},0,null,null,null,null,null,null,0,0,0,{"$f":"T23*'CTI Input Sheet'!K20","v":0},{"$f":"SUM(T23*H11)/60","v":0},null,0,0,0,0,0,0,null,{"$f":"SUM(AB23*AH8)+(AC23*AH9)","v":0},{"$f":"SUM(AD23*AH10)+(AE23*AH11)","v":0},0,null,{"$f":"Z23*AO6/60","v":0},{"$f":"AB23*AO8/60","v":0},{"$f":"AD23*AO9/60","v":0},0,{"$f":"AN23*AL6","v":0},null,{"$f":"IF(ProjectData!H$17=\"Not Required\",0,B23*2)","v":0},0,0,{"$f":"AQ23*11.23","v":0},0,0,0]
[null,{"$f":"SUM(B17:B23)","v":0},null,null,null,null,{"$f":"SUM(G17:G23)","v":0},0,0,0,0,0,0,null,null,null,null,null,null,{"$f":"SUM(T17:T23)","v":0},{"$f":"SUM(U17:U23)","v":0},{"$f":"SUM(V17:V23)","v":0},{"$f":"SUM(W17:W23)","v":0},{"$f":"SUM(X17:X23)","v":0},null,{"$f":"SUM(Z17:Z23)","v":0},0,0,{"$f":"EVEN(SUM(AC17:AC23))","v":0},0,0,null,{"$f":"SUM(AG17:AG23)","v":0},{"$f":"SUM(AH17:AH23)","v":0},{"$f":"SUM(AI17:AI23)","v":0},null,{"$f":"SUM(AK17:AK23)","v":0},{"$f":"SUM(AL17:AL23)","v":0},{"$f":"SUM(AM17:AM23)","v":0},{"$f":"SUM(AN17:AN23)","v":0},{"$f":"SUM(AO17:AO23)","v":0},null,{"$f":"SUM(AQ17:AQ23)","v":0},0,0,0,0,0,0]
[null,null,null,null,null,null,null,null,null,null,null,null,null,null,null,null,null,null,null,null,null,null,{"$f":"W24*'CTI Input Sheet'!H7","v":0},{"$f":"X24*'CTI Input Sheet'!H6","v":0},null,null,{"$f":"AA24*AH12","v":0},{"$f":"AB24*AH8","v":0},{"$f":"AC24*AH9","v":0},{"$f":"AD24*AH10","v":0},{"$f":"AE24*AH11","v":0},null,null,null,null,null,{"$f":"AK24*AL6","v":0},{"$f":"AL24*AL6","v":0},{"$f":"AM24*AL6","v":0}]
[null,"6in Straight Sections",null,"NEMA VE 2 : 6in Height Straight Section : Support Structure Quantity - Support Weight - Support Steel Fabrication, Logistics, Erection Costs",null,null,null,null,null,null,null,null,null,null,null,null,null,null,null,"6\" Straight Section : Support Structure Summary",null,null,null,null,null,"6\" Straight Section : Tray Accessory Quantities ",null,null,null,null,null,null,"6\" Straight Section : Tray Accessory Costs ",null,null,null,"Straight Section : Tray Accessory Installation Time & Installation Cost",null,null,null,null,null,"6\" Straight Section Covers"]
[null,"Quantities/Piece",null,"Tray Width (in)","Support Quantity","Section Length (FT)","Total Str. Section Length (FT)","Total Str. Section Weight (lb)","Total Str. Section Cost (USD)","Total Fabrication Cost (USD)","Total Logistic Cost (USD)","Total Erection Cost (USD","SUM TOTAL COST/SECTION",null,null,null,null,null,null,"Total Quantity of Supports","Total Weight of Supports (LB)","Total Cost of Supports (USD)","Total Design Time (HOURS)","Total Support Instal Time (HOURS)",null,"Splice Plates Quantity (PRS)","Splice Plate Hardware Quantity (PCS)","Hold Down Clamp Quantity (PRS)","Clamp Hardware Quantity (PCS)","Expansion Guides Quantity (PRS)","Guides Hardware Quantity (PCS)",null,"Hold Down Clamps (PR)","Expansion Guides (PR)","Total Accessory Cost",null,"Splice Plates Time/Pair (HRS)","Hold Down Clamp Time/Pair (HRS)","Exp. Guide Time/Pair (HRS)","Total Time (HOURS)","Total Time Cost (USD)",null,"Cover Quantity (PCS)","Clamp Quantity (PCS)","Hardware Quantity (PCS)","Cover Weight (LBS)","Clamp Weight (LBS)","Clamps Cost (USD)","Installation Time (HRS)"]
[null,{"$f":"ProjectData!F24","v":0},null,6,1,1,{"$f":"(E28*F28)*B28","v":0},{"$f":"G28*G11","v":0},{"$f":"G28*G13","v":0},{"$f":"H28*'CTI Input Sheet'!B28","v":0},{"$f":"H28*'CTI Input Sheet'!C28","v":0},{"$f":"H28*'CTI Input Sheet'!D28","v":0},{"$f":"SUM(I28:L28)","v":0},null,null,null,null,null,null,{"$f":"B28*E28","v":0},{"$f":"H28","v":0},{"$f":"M28","v":0},{"$f":"T28*'CTI Input Sheet'!K20","v":0},{"$f":"SUM(T28*H11)/60","v":0},null,{"$f":"B28*1","v":0},{"$f":"Z28*16","v":0},{"$f":"SUM(E28)*(B28*0.3333)","v":0},{"$f":"AB28*4","v":0},{"$f":"SUM(E28)*(B28*0.7777)","v":0},{"$f":"EVEN(AD28)*4","v":0},null,{"$f":"SUM(AB28*AH8)+(AC28*AH9)","v":0},{"$f":"SUM(AD28*AH10)+(AE28*AH11)","v":0},{"$f":"SUM(AG28:AH28)","v":0},null,{"$f":"Z28*AO6/60","v":0},{"$f":"AB28*AO8/60","v":0},{"$f":"AD28*AO9/60","v":0},{"$f":"SUM(AK28:AM28)","v":0},{"$f":"AN28*AL6","v":0},null,{"$f":"IF(ProjectData!H$17=\"Not Required\",0,B28*2)","v":0},{"$f":"AQ28*3","v":0},{"$f":"AR28*4","v":0},{"$f":"AQ28*2.5","v":0},{"$f":"+AR28*AW6","v":0},{"$f":"AR28*AT6","v":0},{"$f":"AR28*AU6/60","v":0}]
[null,{"$f":"ProjectData!F25","v":0},null,9,1,1.25,0,{"$f":"G29*G11","v":0},{"$f":"G29*G13","v":0},{"$f":"H29*'CTI Input Sheet'!B28","v":0},{"$f":"H29*'CTI Input Sheet'!C28","v":0},{"$f":"H29*'CTI Input Sheet'!D28","v":0},0,null,null,null,null,null,null,{"$f":"B29*E29","v":0},{"$f":"H29","v":0},{"$f":"M29","v":0},{"$f":"T29*'CTI Input Sheet'!K20","v":0},{"$f":"SUM(T29*H11)/60","v":0},null,{"$f":"B29*1","v":0},{"$f":"Z29*16","v":0},{"$f":"SUM(E29)*(B29*0.3333)","v":0},{"$f":"AB29*4","v":0},{"$f":"SUM(E29)*(B29*0.7777)","v":0},0,null,{"$f":"SUM(AB29*AH8)+(AC29*AH9)","v":0},{"$f":"SUM(AD29*AH10)+(AE29*AH11)","v":0},0,null,{"$f":"Z29*AO6/60","v":0},{"$f":"AB29*AO8/60","v":0},{"$f":"AD29*AO9/60","v":0},0,{"$f":"AN29*AL6","v":0},null,{"$f":"IF(ProjectData!H$17=\"Not Required\",0,B29*2)","v":0},0,0,{"$f":"AQ29*3.37","v":0},{"$f":"+AR29*AW7","v":0},0,0]
[null,{"$f":"ProjectData!F26","v":30},null,12,1,1.5,45,{"$f":"G30*G11","v":171},{"$f":"G30*G13","v":1026},{"$f":"H30*'CTI Input Sheet'!B28","v":256.5},{"$f":"H30*'CTI Input Sheet'!C28","v":42.75},{"$f":"H30*'CTI Input Sheet'!D28","v":0},1325.25,null,null,null,null,null,null,30,171,1325.25,{"$f":"T30*'CTI Input Sheet'!K20","v":7.5},{"$f":"SUM(T30*H11)/60","v":7.5},null,30,480,9.9989999999999988,39.995999999999995,23.331,96,null,{"$f":"SUM(AB30*AH8)+(AC30*AH9)","v":99.989999999999981},{"$f":"SUM(AD30*AH10)+(AE30*AH11)","v":236.655},336.64499999999998,null,{"$f":"Z30*AO6/60","v":2.5},{"$f":"AB30*AO8/60","v":0.33329999999999999},{"$f":"AD30*AO9/60","v":0.77769999999999995},3.6109999999999998,{"$f":"AN30*AL6","v":270.82499999999999},null,{"$f":"IF(ProjectData!H$17=\"Not Required\",0,B30*2)","v":0},0,0,{"$f":"AQ30*4.24","v":0},0,0,0]
[null,{"$f":"ProjectData!F27","v":0},null,18,1,2,0,{"$f":"G31*G11","v":0},{"$f":"G31*G13","v":0},{"$f":"H31*'CTI Input Sheet'!B28","v":0},{"$f":"H31*'CTI Input Sheet'!C28","v":0},{"$f":"H31*'CTI Input Sheet'!D28","v":0},0,null,null,null,null,null,null,0,0,0,{"$f":"T31*'CTI Input Sheet'!K20","v":0},{"$f":"SUM(T31*H11)/60","v":0},null,0,0,0,0,0,0,null,{"$f":"SUM(AB31*AH8)+(AC31*AH9)","v":0},{"$f":"SUM(AD31*AH10)+(AE31*AH11)","v":0},0,null,{"$f":"Z31*AO6/60","v":0},{"$f":"AB31*AO8/60","v":0},{"$f":"AD31*AO9/60","v":0},0,{"$f":"AN31*AL6","v":0},null,{"$f":"IF(ProjectData!H$17=\"Not Required\",0,B31*2)","v":0},0,0,{"$f":"AQ31*5.98","v":0},0,0,0]
[null,{"$f":"ProjectData!F28","v":0},null,24,1,2.5,0,{"$f":"G32*G11","v":0},{"$f":"G32*G13","v":0},{"$f":"H32*'CTI Input Sheet'!B28","v":0},{"$f":"H32*'CTI Input Sheet'!C28","v":0},{"$f":"H32*'CTI Input Sheet'!D28","v":0},0,null,null,null,null,null,null,0,0,0,{"$f":"T32*'CTI Input Sheet'!K20","v":0},{"$f":"SUM(T32*H11)/60","v":0},null,0,0,0,0,0,0,null,{"$f":"SUM(AB32*AH8)+(AC32*AH9)","v":0},{"$f":"SUM(AD32*AH10)+(AE32*AH11)","v":0},0,null,{"$f":"Z32*AO6/60","v":0},{"$f":"AB32*AO8/60","v":0},{"$f":"AD32*AO9/60","v":0},0,{"$f":"AN32*AL6","v":0},null,{"$f":"IF(ProjectData!H$17=\"Not Required\",0,B32*2)","v":0},0,0,{"$f":"AQ32*7.73","v":0},0,0,0]
[null,{"$f":"ProjectData!F29","v":0},null,30,1,3,0,{"$f":"G33*G11","v":0},{"$f":"G33*G13","v":0},{"$f":"H33*'CTI Input Sheet'!B28","v":0},{"$f":"H33*'CTI Input Sheet'!C28","v":0},{"$f":"H33*'CTI Input Sheet'!D28","v":0},0,null,null,null,null,null,null,0,0,0,{"$f":"T33*'CTI Input Sheet'!K20","v":0},{"$f":"SUM(T33*H11)/60","v":0},null,0,0,0,0,0,0,null,{"$f":"SUM(AB33*AH8)+(AC33*AH9)","v":0},{"$f":"SUM(AD33*AH10)+(AE33*AH11)","v":0},0,null,{"$f":"Z33*AO6/60","v":0},{"$f":"AB33*AO8/60","v":0},{"$f":"AD33*AO9/60","v":0},0,{"$f":"AN33*AL6","v":0},null,{"$f":"IF(ProjectData!H$17=\"Not Required\",0,B33*2)","v":0},0,0,{"$f":"AQ33*9.48","v":0},0,0,0]
[null,{"$f":"ProjectData!F30","v":15},null,36,1,3.5,52.5,{"$f":"G34*G11","v":199.5},{"$f":"G34*G13","v":1197},{"$f":"H34*'CTI Input Sheet'!B28","v":299.25},{"$f":"H34*'CTI Input Sheet'!C28","v":49.875},{"$f":"H34*'CTI Input Sheet'!D28","v":0},1546.125,null,null,null,null,null,null,15,199.5,1546.125,{"$f":"T34*'CTI Input Sheet'!K20","v":3.75},{"$f":"SUM(T34*H11)/60","v":3.75},null,15,240,4.9994999999999994,19.997999999999998,11.6655,48,null,{"$f":"SUM(AB34*AH8)+(AC34*AH9)","v":49.99499999999999},{"$f":"SUM(AD34*AH10)+(AE34*AH11)","v":118.3275},168.32249999999999,null,{"$f":"Z34*AO6/60","v":1.25},{"$f":"AB34*AO8/60","v":0.16664999999999999},{"$f":"AD34*AO9/60","v":0.38884999999999997},1.8054999999999999,{"$f":"AN34*AL6","v":135.41249999999999},null,{"$f":"IF(ProjectData!H$17=\"Not Required\",0,B34*2)","v":0},0,0,{"$f":"AQ34*11.23","v":0},0,0,0]
[null,{"$f":"SUM(B28:B34)","v":45},null,null,null,null,{"$f":"SUM(G28:G34)","v":97.5},370.5,2223,555.75,92.625,0,2871.375,null,null,null,null,null,null,{"$f":"SUM(T28:T34)","v":45},{"$f":"SUM(U28:U34)","v":370.5},{"$f":"SUM(V28:V34)","v":2871.375},{"$f":"SUM(W28:W34)","v":11.25},{"$f":"SUM(X28:X34)","v":11.25},null,{"$f":"SUM(Z28:Z34)","v":45},720,14.998499999999998,59.993999999999993,34.996499999999997,144,null,{"$f":"SUM(AG28:AG34)","v":149.98499999999996},{"$f":"SUM(AH28:AH34)","v":354.98250000000002},{"$f":"SUM(AI28:AI34)","v":504.96749999999997},null,{"$f":"SUM(AK28:AK34)","v":3.75},{"$f":"SUM(AL28:AL34)","v":0.49995000000000001},{"$f":"SUM(AM28:AM34)","v":1.16655},{"$f":"SUM(AN28:AN34)","v":5.4164999999999992},{"$f":"SUM(AO28:AO34)","v":406.23749999999995},null,{"$f":"SUM(AQ28:AQ34)","v":0},0,0,0,0,0,0]
[null,null,null,null,null,null,null,null,null,null,null,null,null,null,null,null,null,null,null,null,null,null,{"$f":"W35*'CTI Input Sheet'!H7","v":843.75},{"$f":"X35*'CTI Input Sheet'!H6","v":843.75},null,null,{"$f":"AA35*AH12","v":540},{"$f":"AB35*AH8","v":74.992499999999993},{"$f":"AC35*AH9","v":74.992499999999993},{"$f":"AD35*AH10","v":174.98249999999999},{"$f":"AE35*AH11","v":180},null,null,null,null,null,{"$f":"AK35*AL6","v":281.25},{"$f":"AL35*AL6","v":37.496250000000003},{"$f":"AM35*AL6","v":87.491249999999994}]
[null,"HB Fittings",null,"HB Fittings",null,"NEMA VE 2 : HB Support Quantity - Support Weight - Support Steel Fabrication, Logistics, Erection Costs",null,null,null,null,null,null,null,null,null,null,null,null,null,"HB : Support Structure Summary",null,null,null,null,null,"HB : Tray Accessory Quantities ",null,null,null,null,null,null,"HB : Tray Accessory Costs ",null,null,null,"HB : Tray Accessory Installation Time & Installation Cost",null,null,null,null,null,"HB Covers"]
[null,"Quantities/Piece",null,"HB Width (in)","HB Radius (in) ","Support Quantity","OS1 Str. Section Length (FT)","OS2 Str. Section Length (FT)","CTR Str. Section Length (FT)","Total Str. Section Length (FT)","Total Str. Section Weight (lb)","Total Str. Section Cost (USD)","Total Fabrication Cost (USD)","Total Logistic Cost (USD)","Total Erection Cost (USD","SUM TOTAL COST/FITTING",null,null,null,"Total Quantity of Supports","Total Weight of Supports (LB)","Total Cost of Supports (USD)","Total Design Time (HOURS)","Total Support Instal Time (HOURS)",null,"Splice Plates Quantity (PRS)","Splice Plate Hardware Quantity (PCS)","Hold Down Clamp Quantity (PRS)","Clamp Hardware Quantity (PCS)","Expansion Guides Quantity (PRS)","Guides Hardware Quantity (PCS)",null,"Hold Down Clamps (PR)","Expansion Guides (PR)","Total Accessory Cost",null,"Splice Plates Time/Pair (HRS)","Hold Down Clamp Time/Pair (HRS)","Exp. Guide Time/Pair (HRS)","Total Time (HOURS)","Total Time Cost (USD)",null,"Cover Quantity (PCS)","Clamp Quantity (PCS)","Hardware Quantity (PCS)","Cover Weight (LBS)","Clamp Weight (LBS)","Clamps Cost (USD)","Installation Time (HRS)"]
[null,{"$f":"ProjectData!D37","v":0},null,6,12,3,1,2,2.5,{"$f":"SUM(G39+H39+I39)*B39","v":0},{"$f":"J39*G11","v":0},{"$f":"J39*G13","v":0},{"$f":"K39*'CTI Input Sheet'!B28","v":0},{"$f":"K39*'CTI Input Sheet'!C28","v":0},{"$f":"K39*'CTI Input Sheet'!D28","v":0},{"$f":"SUM(L39:O39)","v":0},null,null,null,{"$f":"B39*F39","v":0},{"$f":"K39","v":0},{"$f":"P39","v":0},{"$f":"T39*'CTI Input Sheet'!K21","v":0},{"$f":"SUM(T39*H11)/60","v":0},null,{"$f":"B39*2","v":0},{"$f":"Z39*16","v":0},{"$f":"(F39)*B39","v":0},{"$f":"AB39*4","v":0},0,0,null,{"$f":"SUM(AB39*AH8)+(AC39*AH9)","v":0},{"$f":"SUM(AD39*AH10)+(AD39*AH11)","v":0},{"$f":"SUM(AG39:AH39)","v":0},null,{"$f":"Z39*AO6/60","v":0},{"$f":"AB39*AO8/60","v":0},{"$f":"AD39*AO9/60","v":0},{"$f":"SUM(AK39:AM39)","v":0},{"$f":"AN39*AL6","v":0},null,{"$f":"IF(ProjectData!H$17=\"Not Required\",0,B39*2)","v":0},{"$f":"AQ39*2","v":0},{"$f":"AR39*4","v":0},{"$f":"AQ39*0.49","v":0},{"$f":"+AR39*AW6","v":0},{"$f":"AR39*AT6","v":0},{"$f":"AR39*AU6/60","v":0}]
[null,{"$f":"ProjectData!D38","v":0},null,6,24,3,1,3,3.5,0,{"$f":"J40*G11","v":0},{"$f":"J40*G13","v":0},{"$f":"K40*'CTI Input Sheet'!B28","v":0},{"$f":"K40*'CTI Input Sheet'!C28","v":0},{"$f":"K40*'CTI Input Sheet'!D28","v":0},0,null,null,null,{"$f":"B40*F40","v":0},0,0,{"$f":"T40*'CTI Input Sheet'!K21","v":0},{"$f":"SUM(T40*H11)/60","v":0},null,0,0,0,0,0,0,null,{"$f":"SUM(AB40*AH8)+(AC40*AH9)","v":0},{"$f":"SUM(AD40*AH10)+(AD40*AH11)","v":0},0,null,{"$f":"Z40*AO6/60","v":0},{"$f":"AB40*AO8/60","v":0},{"$f":"AD40*AO9/60","v":0},0,{"$f":"AN40*AL6","v":0},null,{"$f":"IF(ProjectData!H$17=\"Not Required\",0,B40*2)","v":0},0,0,{"$f":"AQ40*0.88","v":0},{"$f":"+AR40*AW6","v":0},{"$f":"AR40*AT6","v":0},{"$f":"AR40*AU7/60","v":0}]
[null,{"$f":"ProjectData!D39","v":0},null,6,36,3,1,4,4.5,0,{"$f":"J41*G11","v":0},{"$f":"J41*G13","v":0},{"$f":"K41*'CTI Input Sheet'!B28","v":0},{"$f":"K41*'CTI Input Sheet'!C28","v":0},{"$f":"K41*'CTI Input Sheet'!D28","v":0},0,null,null,null,0,0,0,{"$f":"T41*'CTI Input Sheet'!K21","v":0},{"$f":"SUM(T41*H11)/60","v":0},null,0,0,0,0,0,0,null,{"$f":"SUM(AB41*AH8)+(AC41*AH9)","v":0},{"$f":"SUM(AD41*AH10)+(AD41*AH11)","v":0},0,null,{"$f":"Z41*AO6/60","v":0},{"$f":"AB41*AO8/60","v":0},{"$f":"AD41*AO9/60","v":0},0,{"$f":"AN41*AL6","v":0},null,{"$f":"IF(ProjectData!H$17=\"Not Required\",0,B41*2)","v":0},0,0,{"$f":"AQ41*1.28","v":0},{"$f":"+AR41*AW6","v":0},{"$f":"AR41*AT6","v":0},{"$f":"A636*AU8/60","v":0}]
[null,{"$f":"ProjectData!D40","v":0},null,9,12,3,1.25,2.25,2.75,0,{"$f":"J42*G11","v":0},{"$f":"J42*G13","v":0},{"$f":"K42*'CTI Input Sheet'!B28","v":0},{"$f":"K42*'CTI Input Sheet'!C28","v":0},{"$f":"K42*'CTI Input Sheet'!D28","v":0},0,null,null,null,0,0,0,{"$f":"T42*'CTI Input Sheet'!K21","v":0},{"$f":"SUM(T42*H11)/60","v":0},null,0,0,0,0,0,0,null,{"$f":"SUM(AB42*AH8)+(AC42*AH9)","v":0},{"$f":"SUM(AD42*AH10)+(AD42*AH11)","v":0},0,null,{"$f":"Z42*AO6/60","v":0},{"$f":"AB42*AO8/60","v":0},{"$f":"AD42*AO9/60","v":0},0,{"$f":"AN42*AL6","v":0},null,{"$f":"IF(ProjectData!H$17=\"Not Required\",0,B42*2)","v":0},0,0,{"$f":"AQ42*0.73","v":0},{"$f":"+AR42*AW7","v":0},{"$f":"AR42*AT7","v":0},{"$f":"AR42*AU7/60","v":0}]
[null,{"$f":"ProjectData!D41","v":0},null,9,24,3,1.25,3.25,3.75,0,{"$f":"J43*G11","v":0},{"$f":"J43*G13","v":0},{"$f":"K43*'CTI Input Sheet'!B28","v":0},{"$f":"K43*'CTI Input Sheet'!C28","v":0},{"$f":"K43*'CTI Input Sheet'!D28","v":0},0,null,null,null,0,0,0,{"$f":"T43*'CTI Input Sheet'!K21","v":0},{"$f":"SUM(T43*H11)/60","v":0},null,0,0,0,0,0,0,null,{"$f":"SUM(AB43*AH8)+(AC43*AH9)","v":0},{"$f":"SUM(AD43*AH10)+(AD43*AH11)","v":0},0,null,{"$f":"Z43*AO6/60","v":0},{"$f":"AB43*AO8/60","v":0},{"$f":"AD43*AO9/60","v":0},0,{"$f":"AN43*AL6","v":0},null,{"$f":"IF(ProjectData!H$17=\"Not Required\",0,B43*2)","v":0},0,0,{"$f":"AQ43*1.26","v":0},{"$f":"+AR43*AW7","v":0},{"$f":"AR43*AT7","v":0},{"$f":"AR43*AU7/60","v":0}]
[null,{"$f":"ProjectData!D42","v":0},null,9,36,3,1.25,4.25,4.75,0,{"$f":"J44*G11","v":0},{"$f":"J44*G13","v":0},{"$f":"K44*'CTI Input Sheet'!B28","v":0},{"$f":"K44*'CTI Input Sheet'!C28","v":0},{"$f":"K44*'CTI Input Sheet'!D28","v":0},0,null,null,null,0,0,0,{"$f":"T44*'CTI Input Sheet'!K21","v":0},{"$f":"SUM(T44*H11)/60","v":0},null,0,0,0,0,0,0,null,{"$f":"SUM(AB44*AH8)+(AC44*AH9)","v":0},{"$f":"SUM(AD44*AH10)+(AD44*AH11)","v":0},0,null,{"$f":"Z44*AO6/60","v":0},{"$f":"AB44*AO8/60","v":0},{"$f":"AD44*AO9/60","v":0},0,{"$f":"AN44*AL6","v":0},null,{"$f":"IF(ProjectData!H$17=\"Not Required\",0,B44*2)","v":0},0,0,{"$f":"AQ44*1.79","v":0},{"$f":"+AR44*AW7","v":0},{"$f":"AR44*AT7","v":0},{"$f":"AR44*AU7/60","v":0}]
[null,{"$f":"ProjectData!D43","v":3},null,12,12,3,1.5,2.5,3,21,{"$f":"J45*G11","v":79.8},{"$f":"J45*G13","v":478.8},{"$f":"K45*'CTI Input Sheet'!B28","v":119.69999999999999},{"$f":"K45*'CTI Input Sheet'!C28","v":19.95},{"$f":"K45*'CTI Input Sheet'!D28","v":0},618.45000000000005,null,null,null,9,79.8,618.45000000000005,{"$f":"T45*'CTI Input Sheet'!K21","v":13.5},{"$f":"SUM(T45*H11)/60","v":2.25},null,6,96,9,36,0,0,null,{"$f":"SUM(AB45*AH8)+(AC45*AH9)","v":90},{"$f":"SUM(AD45*AH10)+(AD45*AH11)","v":0},90,null,{"$f":"Z45*AO6/60","v":0.5},{"$f":"AB45*AO8/60","v":0.3},{"$f":"AD45*AO9/60","v":0},0.8,{"$f":"AN45*AL6","v":60},null,{"$f":"IF(ProjectData!H$17=\"Not Required\",0,B45*2)","v":0},0,0,{"$f":"AQ45*1","v":0},{"$f":"+AR45*AW8","v":0},{"$f":"AR45*AT8","v":0},{"$f":"AR45*AU8/60","v":0}]
[null,{"$f":"ProjectData!D44","v":0},null,12,24,3,1.5,3.5,4,0,{"$f":"J46*G11","v":0},{"$f":"J46*G13","v":0},{"$f":"K46*'CTI Input Sheet'!B28","v":0},{"$f":"K46*'CTI Input Sheet'!C28","v":0},{"$f":"K46*'CTI Input Sheet'!D28","v":0},0,null,null,null,0,0,0,{"$f":"T46*'CTI Input Sheet'!K21","v":0},{"$f":"SUM(T46*H11)/60","v":0},null,0,0,0,0,0,0,null,{"$f":"SUM(AB46*AH8)+(AC46*AH9)","v":0},{"$f":"SUM(AD46*AH10)+(AD46*AH11)","v":0},0,null,{"$f":"Z46*AO6/60","v":0},{"$f":"AB46*AO8/60","v":0},{"$f":"AD46*AO9/60","v":0},0,{"$f":"AN46*AL6","v":0},null,{"$f":"IF(ProjectData!H$17=\"Not Required\",0,B46*2)","v":0},0,0,{"$f":"AQ46*1.66","v":0},{"$f":"+AR46*AW8","v":0},{"$f":"AR46*AT8","v":0},{"$f":"AR46*AU8/60","v":0}]
[null,{"$f":"ProjectData!D45","v":0},null,12,36,3,1.5,4.5,5,0,{"$f":"J47*G11","v":0},{"$f":"J47*G13","v":0},{"$f":"K47*'CTI Input Sheet'!B28","v":0},{"$f":"K47*'CTI Input Sheet'!C28","v":0},{"$f":"K47*'CTI Input Sheet'!D28","v":0},0,null,null,null,0,0,0,{"$f":"T47*'CTI Input Sheet'!K21","v":0},{"$f":"SUM(T47*H11)/60","v":0},null,0,0,0,0,0,0,null,{"$f":"SUM(AB47*AH8)+(AC47*AH9)","v":0},{"$f":"SUM(AD47*AH10)+(AD47*AH11)","v":0},0,null,{"$f":"Z47*AO6/60","v":0},{"$f":"AB47*AO8/60","v":0},{"$f":"AD47*AO9/60","v":0},0,{"$f":"AN47*AL6","v":0},null,{"$f":"IF(ProjectData!H$17=\"Not Required\",0,B47*2)","v":0},0,0,{"$f":"AQ47*2.33","v":0},{"$f":"+AR47*AW8","v":0},{"$f":"AR47*AT8","v":0},{"$f":"AR47*AU8/60","v":0}]
[null,{"$f":"ProjectData!D46","v":0},null,18,12,3,2,3,3.5,0,{"$f":"J48*G11","v":0},{"$f":"J48*G13","v":0},{"$f":"K48*'CTI Input Sheet'!B28","v":0},{"$f":"K48*'CTI Input Sheet'!C28","v":0},{"$f":"K48*'CTI Input Sheet'!D28","v":0},0,null,null,null,0,0,0,{"$f":"T48*'CTI Input Sheet'!K21","v":0},{"$f":"SUM(T48*H11)/60","v":0},null,0,0,0,0,0,0,null,{"$f":"SUM(AB48*AH8)+(AC48*AH9)","v":0},{"$f":"SUM(AD48*AH10)+(AD48*AH11)","v":0},0,null,{"$f":"Z48*AO6/60","v":0},{"$f":"AB48*AO8/60","v":0},{"$f":"AD48*AO9/60","v":0},0,{"$f":"AN48*AL6","v":0},null,{"$f":"IF(ProjectData!H$17=\"Not Required\",0,B48*2)","v":0},0,0,{"$f":"AQ48*1.64","v":0},{"$f":"+AR48*AW9","v":0},{"$f":"AR48*AT9","v":0},{"$f":"AR48*AU9/60","v":0}]
[null,{"$f":"ProjectData!D47","v":0},null,18,24,3,2,4,4.5,0,{"$f":"J49*G11","v":0},{"$f":"J49*G13","v":0},{"$f":"K49*'CTI Input Sheet'!B28","v":0},{"$f":"K49*'CTI Input Sheet'!C28","v":0},{"$f":"K49*'CTI Input Sheet'!D28","v":0},0,null,null,null,0,0,0,{"$f":"T49*'CTI Input Sheet'!K21","v":0},{"$f":"SUM(T49*H11)/60","v":0},null,0,0,0,0,0,0,null,{"$f":"SUM(AB49*AH8)+(AC49*AH9)","v":0},{"$f":"SUM(AD49*AH10)+(AD49*AH11)","v":0},0,null,{"$f":"Z49*AO6/60","v":0},{"$f":"AB49*AO8/60","v":0},{"$f":"AD49*AO9/60","v":0},0,{"$f":"AN49*AL6","v":0},null,{"$f":"IF(ProjectData!H$17=\"Not Required\",0,B49*2)","v":0},0,0,{"$f":"AQ49*2.58","v":0},{"$f":"+AR49*AW9","v":0},{"$f":"AR49*AT9","v":0},{"$f":"AR49*AU9/60","v":0}]
[null,{"$f":"ProjectData!D48","v":0},null,18,36,3,2,5,5.5,0,{"$f":"J50*G11","v":0},{"$f":"J50*G13","v":0},{"$f":"K50*'CTI Input Sheet'!B28","v":0},{"$f":"K50*'CTI Input Sheet'!C28","v":0},{"$f":"K50*'CTI Input Sheet'!D28","v":0},0,null,null,null,0,0,0,{"$f":"T50*'CTI Input Sheet'!K21","v":0},{"$f":"SUM(T50*H11)/60","v":0},null,0,0,0,0,0,0,null,{"$f":"SUM(AB50*AH8)+(AC50*AH9)","v":0},{"$f":"SUM(AD50*AH10)+(AD50*AH11)","v":0},0,null,{"$f":"Z50*AO6/60","v":0},{"$f":"AB50*AO8/60","v":0},{"$f":"AD50*AO9/60","v":0},0,{"$f":"AN50*AL6","v":0},null,{"$f":"IF(ProjectData!H$17=\"Not Required\",0,B50*2)","v":0},0,0,{"$f":"AQ50*3.52","v":0},{"$f":"+AR50*AW9","v":0},{"$f":"AR50*AT9","v":0},{"$f":"AR50*AU9/60","v":0}]
[null,{"$f":"ProjectData!D49","v":0},null,24,12,3,2.5,3.5,4,0,{"$f":"J51*G11","v":0},{"$f":"J51*G13","v":0},{"$f":"K51*'CTI Input Sheet'!B28","v":0},{"$f":"K51*'CTI Input Sheet'!C28","v":0},{"$f":"K51*'CTI Input Sheet'!D28","v":0},0,null,null,null,0,0,{"$f":"P51","v":0},{"$f":"T51*'CTI Input Sheet'!K21","v":0},{"$f":"SUM(T51*H11)/60","v":0},null,0,0,0,0,0,0,null,{"$f":"SUM(AB51*AH8)+(AC51*AH9)","v":0},{"$f":"SUM(AD51*AH10)+(AD51*AH11)","v":0},0,null,{"$f":"Z51*AO6/60","v":0},{"$f":"AB51*AO8/60","v":0},{"$f":"AD51*AO9/60","v":0},0,{"$f":"AN51*AL6","v":0},null,{"$f":"IF(ProjectData!H$17=\"Not Required\",0,B51*2)","v":0},0,0,{"$f":"AQ51*2.43","v":0},{"$f":"+AR51*AW10","v":0},{"$f":"AR51*AT10","v":0},{"$f":"AR51*AU10/60","v":0}]
[null,{"$f":"ProjectData!D50","v":0},null,24,24,3,2.5,4.5,5,0,{"$f":"J52*G11","v":0},{"$f":"J52*G13","v":0},{"$f":"K52*'CTI Input Sheet'!B28","v":0},{"$f":"K52*'CTI Input Sheet'!C28","v":0},{"$f":"K52*'CTI Input Sheet'!D28","v":0},0,null,null,null,0,0,{"$f":"P52","v":0},{"$f":"T52*'CTI Input Sheet'!K21","v":0},{"$f":"SUM(T52*H11)/60","v":0},null,0,0,0,0,0,0,null,{"$f":"SUM(AB52*AH8)+(AC52*AH9)","v":0},{"$f":"SUM(AD52*AH10)+(AD52*AH11)","v":0},0,null,{"$f":"Z52*AO6/60","v":0},{"$f":"AB52*AO8/60","v":0},{"$f":"AD52*AO9/60","v":0},0,{"$f":"AN52*AL6","v":0},null,{"$f":"IF(ProjectData!H$17=\"Not Required\",0,B52*2)","v":0},0,0,{"$f":"AQ52*3.64","v":0},{"$f":"+AR52*AW10","v":0},{"$f":"AR52*AT10","v":0},{"$f":"AR52*AU10/60","v":0}]
[null,{"$f":"ProjectData!D51","v":0},null,24,36,3,2.5,5.5,6,0,{"$f":"J53*G11","v":0},{"$f":"J53*G13","v":0},{"$f":"K53*'CTI Input Sheet'!B28","v":0},{"$f":"K53*'CTI Input Sheet'!C28","v":0},{"$f":"K53*'CTI Input Sheet'!D28","v":0},0,null,null,null,0,0,0,{"$f":"T53*'CTI Input Sheet'!K21","v":0},{"$f":"SUM(T53*H11)/60","v":0},null,0,0,0,0,0,0,null,{"$f":"SUM(AB53*AH8)+(AC53*AH9)","v":0},{"$f":"SUM(AD53*AH10)+(AD53*AH11)","v":0},0,null,{"$f":"Z53*AO6/60","v":0},{"$f":"AB53*AO8/60","v":0},{"$f":"AD53*AO9/60","v":0},0,{"$f":"AN53*AL6","v":0},null,{"$f":"IF(ProjectData!H$17=\"Not Required\",0,B53*2)","v":0},0,0,{"$f":"AQ53*4.86","v":0},{"$f":"+AR53*AW10","v":0},{"$f":"AR53*AT10","v":0},{"$f":"AR53*AU10/60","v":0}]
[null,{"$f":"ProjectData!D52","v":0},null,30,12,3,3,4,4.5,0,{"$f":"J54*G11","v":0},{"$f":"J54*G13","v":0},{"$f":"K54*'CTI Input Sheet'!B28","v":0},{"$f":"K54*'CTI Input Sheet'!C28","v":0},{"$f":"K54*'CTI Input Sheet'!D28","v":0},0,null,null,null,0,0,0,{"$f":"T54*'CTI Input Sheet'!K21","v":0},{"$f":"SUM(T54*H11)/60","v":0},null,0,0,0,0,0,0,null,{"$f":"SUM(AB54*AH8)+(AC54*AH9)","v":0},{"$f":"SUM(AD54*AH10)+(AD54*AH11)","v":0},0,null,{"$f":"Z54*AO6/60","v":0},{"$f":"AB54*AO8/60","v":0},{"$f":"AD54*AO9/60","v":0},0,{"$f":"AN54*AL6","v":0},null,{"$f":"IF(ProjectData!H$17=\"Not Required\",0,B54*2)","v":0},0,0,{"$f":"AQ54*3.35","v":0},{"$f":"+AR54*AW11","v":0},{"$f":"AR54*AT11","v":0},{"$f":"AR54*AU11/60","v":0}]
[null,{"$f":"ProjectData!D53","v":0},null,30,24,3,3,5,5.5,0,{"$f":"J55*G11","v":0},{"$f":"J55*G13","v":0},{"$f":"K55*'CTI Input Sheet'!B28","v":0},{"$f":"K55*'CTI Input Sheet'!C28","v":0},{"$f":"K55*'CTI Input Sheet'!D28","v":0},0,null,null,null,0,0,0,{"$f":"T55*'CTI Input Sheet'!K21","v":0},{"$f":"SUM(T55*H11)/60","v":0},null,0,0,0,0,0,0,null,{"$f":"SUM(AB55*AH8)+(AC55*AH9)","v":0},{"$f":"SUM(AD55*AH10)+(AD55*AH11)","v":0},0,null,{"$f":"Z55*AO6/60","v":0},{"$f":"AB55*AO8/60","v":0},{"$f":"AD55*AO9/60","v":0},0,{"$f":"AN55*AL6","v":0},null,{"$f":"IF(ProjectData!H$17=\"Not Required\",0,B55*2)","v":0},0,0,{"$f":"AQ55*4.84","v":0},{"$f":"+AR55*AW11","v":0},{"$f":"AR55*AT11","v":0},{"$f":"AR55*AU11/60","v":0}]
[null,{"$f":"ProjectData!D54","v":0},null,30,36,3,3,6,6.5,0,{"$f":"J56*G11","v":0},{"$f":"J56*G13","v":0},{"$f":"K56*'CTI Input Sheet'!B28","v":0},{"$f":"K56*'CTI Input Sheet'!C28","v":0},{"$f":"K56*'CTI Input Sheet'!D28","v":0},0,null,null,null,0,0,0,{"$f":"T56*'CTI Input Sheet'!K21","v":0},{"$f":"SUM(T56*H11)/60","v":0},null,0,0,0,0,0,0,null,{"$f":"SUM(AB56*AH8)+(AC56*AH9)","v":0},{"$f":"SUM(AD56*AH10)+(AD56*AH11)","v":0},0,null,{"$f":"Z56*AO6/60","v":0},{"$f":"AB56*AO8/60","v":0},{"$f":"AD56*AO9/60","v":0},0,{"$f":"AN56*AL6","v":0},null,{"$f":"IF(ProjectData!H$17=\"Not Required\",0,B56*2)","v":0},0,0,{"$f":"AQ56*6.33","v":0},{"$f":"+AR56*AW11","v":0},{"$f":"AR56*AT11","v":0},{"$f":"AR56*AU11/60","v":0}]
[null,{"$f":"ProjectData!D55","v":1},null,36,12,3,3.5,4.5,5,13,{"$f":"J57*G11","v":49.4},{"$f":"J57*G13","v":296.40000000000003},{"$f":"K57*'CTI Input Sheet'!B28","v":74.099999999999994},{"$f":"K57*'CTI Input Sheet'!C28","v":12.35},{"$f":"K57*'CTI Input Sheet'!D28","v":0},382.85,null,null,null,3,49.4,382.85,{"$f":"T57*'CTI Input Sheet'!K21","v":4.5},{"$f":"SUM(T57*H11)/60","v":0.75},null,2,32,3,12,0,0,null,{"$f":"SUM(AB57*AH8)+(AC57*AH9)","v":30},{"$f":"SUM(AD57*AH10)+(AD57*AH11)","v":0},30,null,{"$f":"Z57*AO6/60","v":0.16666666666666666},{"$f":"AB57*AO8/60","v":0.1},{"$f":"AD57*AO9/60","v":0},0.26666666666666666,{"$f":"AN57*AL6","v":20},null,{"$f":"IF(ProjectData!H$17=\"Not Required\",0,B57*2)","v":0},0,0,{"$f":"AQ57*4.41","v":0},{"$f":"+AR57*AW12","v":0},{"$f":"AR57*AT12","v":0},{"$f":"AR57*AU12/60","v":0}]
[null,{"$f":"ProjectData!D56","v":0},null,36,24,3,3.5,5.5,6,0,{"$f":"J58*G11","v":0},{"$f":"J58*G13","v":0},{"$f":"K58*'CTI Input Sheet'!B28","v":0},{"$f":"K58*'CTI Input Sheet'!C28","v":0},{"$f":"K58*'CTI Input Sheet'!D28","v":0},0,null,null,null,0,0,0,{"$f":"T58*'CTI Input Sheet'!K21","v":0},{"$f":"SUM(T58*H11)/60","v":0},null,0,0,0,0,0,0,null,{"$f":"SUM(AB58*AH8)+(AC58*AH9)","v":0},{"$f":"SUM(AD58*AH10)+(AD58*AH11)","v":0},0,null,{"$f":"Z58*AO6/60","v":0},{"$f":"AB58*AO8/60","v":0},{"$f":"AD58*AO9/60","v":0},0,{"$f":"AN58*AL6","v":0},null,{"$f":"IF(ProjectData!H$17=\"Not Required\",0,B58*2)","v":0},0,0,{"$f":"AQ58*6.17","v":0},{"$f":"+AR58*AW12","v":0},{"$f":"AR58*AT12","v":0},{"$f":"AR58*AU12/60","v":0}]
[null,{"$f":"ProjectData!D57","v":0},null,36,36,3,3.5,6.5,7,0,{"$f":"J59*G11","v":0},{"$f":"J59*G13","v":0},{"$f":"K59*'CTI Input Sheet'!B28","v":0},{"$f":"K59*'CTI Input Sheet'!C28","v":0},{"$f":"K59*'CTI Input Sheet'!D28","v":0},{"$f":"SUM(L59:O59)","v":0},null,null,null,0,0,0,{"$f":"T59*'CTI Input Sheet'!K21","v":0},{"$f":"SUM(T59*H11)/60","v":0},null,0,0,0,0,0,0,null,{"$f":"SUM(AB59*AH8)+(AC59*AH9)","v":0},{"$f":"SUM(AD59*AH10)+(AD59*AH11)","v":0},0,null,{"$f":"Z59*AO6/60","v":0},{"$f":"AB59*AO8/60","v":0},{"$f":"AD59*AO9/60","v":0},0,{"$f":"AN59*AL6","v":0},null,{"$f":"IF(ProjectData!H$17=\"Not Required\",0,B59*2)","v":0},0,0,{"$f":"AQ59*7.94","v":0},{"$f":"+AR59*AW12","v":0},{"$f":"AR59*AT12","v":0},{"$f":"AR59*AU12/60","v":0}]
[null,{"$f":"SUM(B39:B59)","v":4},null,null,null,null,null,null,null,{"$f":"SUM(J39:J59)","v":34},129.19999999999999,775.2,193.79999999999998,32.299999999999997,0,1001.3000000000001,null,null,null,{"$f":"SUM(T39:T59)","v":12},{"$f":"SUM(U39:U59)","v":129.19999999999999},{"$f":"SUM(V39:V59)","v":1001.3000000000001},{"$f":"SUM(W39:W59)","v":18},{"$f":"SUM(X39:X59)","v":3},null,{"$f":"SUM(Z39:Z59)","v":8},128,12,48,0,0,null,{"$f":"SUM(AG39:AG59)","v":120},{"$f":"SUM(AH39:AH59)","v":0},{"$f":"SUM(AI39:AI59)","v":120},null,{"$f":"SUM(AK39:AK59)","v":0.66666666666666663},{"$f":"SUM(AL39:AL59)","v":0.4},{"$f":"SUM(AM39:AM59)","v":0},{"$f":"SUM(AN39:AN59)","v":1.0666666666666667},{"$f":"SUM(AO39:AO59)","v":80},null,{"$f":"SUM(AQ39:AQ59)","v":0},0,0,0,0,0,0]
[null,null,null,null,null,null,null,null,null,null,null,null,null,null,null,null,null,null,null,null,null,null,{"$f":"W60*'CTI Input Sheet'!H7","v":1350},{"$f":"X60*'CTI Input Sheet'!H6","v":225},null,null,{"$f":"AA60*AH12","v":96},{"$f":"AB60*AH8","v":60},{"$f":"AC60*AH9","v":60},{"$f":"AD60*AH10","v":0},{"$f":"AE60*AH11","v":0},null,null,null,null,null,{"$f":"AK60*AL6","v":50},{"$f":"AL60*AL6","v":30},{"$f":"AM60*AL6","v":0}]
[null,"HT Fittings",null,"HT Fittings",null,"NEMA VE 2 : HT Support Quantity - Support Weight - Support Steel, Fabrication, Logistics, Erection Costs",null,null,null,null,null,null,null,null,null,null,null,null,null,"HT : Support Structure Summary",null,null,null,null,null,"HT : Accessory Quantities ",null,null,null,null,null,null,"HT : Tray Accessory Costs ",null,null,null,"HT : Tray Accessory Installation Time & Installation Cost",null,null,null,null,null,"HT Covers"]
[null,"Quantities",null,"HB Width (in)","HB Radius (in) ","Support Quantity","OS1 Str. Section Length (FT)","OS2 Str. Section Length (FT)","OS3 Str. Section Length (FT)","CTR Str. Section Length (FT)","Total Str. Section Length (FT)","Total Str. Section Weight (lb)","Total Str. Section Cost (USD)","Total Fabrication Cost (USD)","Total Logistic Cost (USD)","Total Erection Cost (USD)","SUM TOTAL COST/FITTING",null,null,"Total Quantity of Supports","Total Weight of Supports (LB)","Total Cost of Supports (USD)","Total Design Time (HOURS)","Total Support Instal Time (HOURS)",null,"Splice Plates Quantity (PRS)","Splice Plate Hardware Quantity (PCS)","Hold Down Clamp Quantity (PRS)","Clamp Hardware Quantity (PCS)","Expansion Guides Quantity (PRS)","Guides Hardware Quantity (PCS)",null,"Hold Down Clamps (PR)","Expansion Guides (PR)","Total Accessory Cost",null,"Splice Plates Time/Pair (HRS)","Hold Down Clamp Time/Pair (HRS)","Exp. Guide Time/Pair (HRS)","Total Time (HOURS)","Total Time Cost (USD)",null,"Cover Quantity (PCS)","Clamp Quantity (PCS)","Hardware Quantity (PCS)","Cover Weight (LBS)","Clamp Weight (LBS)","Clamps Cost (USD)","Installation Time (HRS)"]
[null,{"$f":"ProjectData!D61","v":0},null,6,12,4,1,1,2.5,4,{"$f":"SUM(G64+H64+I64+J64)*B64","v":0},{"$f":"K64*G11","v":0},{"$f":"K64*G13","v":0},{"$f":"L64*'CTI Input Sheet'!B28","v":0},{"$f":"L64*'CTI Input Sheet'!C28","v":0},{"$f":"L64*'CTI Input Sheet'!D28","v":0},{"$f":"SUM(M64:P64)","v":0},null,null,{"$f":"B64*F64","v":0},{"$f":"L64","v":0},{"$f":"Q64","v":0},{"$f":"T64*'CTI Input Sheet'!K22","v":0},{"$f":"SUM(T64*H11)/60","v":0},null,{"$f":"B64*3","v":0},{"$f":"Z64*16","v":0},{"$f":"(F64+0.5)*B64","v":0},{"$f":"AB64*4","v":0},0,0,null,{"$f":"SUM(AB64*AH8)+(AC64*AH9)","v":0},0,{"$f":"SUM(AG64:AH64)","v":0},null,{"$f":"Z64*AO6/60","v":0},{"$f":"AB64*AO8/60","v":0},0,{"$f":"SUM(AK64:AM64)","v":0},{"$f":"AN64*AL6","v":0},null,{"$f":"IF(ProjectData!H$17=\"Not Required\",0,B64*2)","v":0},{"$f":"AQ64*3","v":0},{"$f":"AR64*4","v":0},{"$f":"AQ64*1.02","v":0},{"$f":"+AR64*AW6","v":0},{"$f":"AR64*AT6","v":0},{"$f":"AR64*AU6/60","v":0}]
[null,{"$f":"ProjectData!D62","v":0},null,6,24,4,1,1,3.5,5,{"$f":"SUM(G65+H65+I65+J65)*B65","v":0},{"$f":"K65*G11","v":0},{"$f":"K65*G13","v":0},{"$f":"L65*'CTI Input Sheet'!B28","v":0},{"$f":"L65*'CTI Input Sheet'!C28","v":0},{"$f":"L65*'CTI Input Sheet'!D28","v":0},{"$f":"SUM(M65:P65)","v":0},null,null,{"$f":"B65*F65","v":0},0,0,{"$f":"T65*'CTI Input Sheet'!K22","v":0},{"$f":"SUM(T65*H11)/60","v":0},null,0,0,0,0,0,0,null,{"$f":"SUM(AB65*AH8)+(AC65*AH9)","v":0},0,0,null,{"$f":"Z65*AO6/60","v":0},{"$f":"AB65*AO8/60","v":0},0,0,{"$f":"AN65*AL6","v":0},null,{"$f":"IF(ProjectData!H$17=\"Not Required\",0,B65*2)","v":0},0,0,{"$f":"AQ65*2.27","v":0},{"$f":"+AR65*AW6","v":0},{"$f":"AR65*AT6","v":0},{"$f":"AR65*AU6/60","v":0}]
[null,{"$f":"ProjectData!D63","v":0},null,6,36,4,1,1,4.5,6,0,{"$f":"K66*G11","v":0},{"$f":"K66*G13","v":0},{"$f":"L66*'CTI Input Sheet'!B28","v":0},{"$f":"L66*'CTI Input Sheet'!C28","v":0},{"$f":"L66*'CTI Input Sheet'!D28","v":0},0,null,null,0,0,0,{"$f":"T66*'CTI Input Sheet'!K22","v":0},{"$f":"SUM(T66*H11)/60","v":0},null,0,0,0,0,0,0,null,{"$f":"SUM(AB66*AH8)+(AC66*AH9)","v":0},0,0,null,{"$f":"Z66*AO6/60","v":0},{"$f":"AB66*AO8/60","v":0},0,0,{"$f":"AN66*AL6","v":0},null,{"$f":"IF(ProjectData!H$17=\"Not Required\",0,B66*2)","v":0},0,0,{"$f":"AQ66*3.88","v":0},{"$f":"+AR66*AW6","v":0},{"$f":"AR66*AT6","v":0},{"$f":"AR66*AU6/60","v":0}]
[null,{"$f":"ProjectData!D64","v":0},null,9,12,4,1.25,1.25,2.75,4.25,0,{"$f":"K67*G11","v":0},{"$f":"K67*G13","v":0},{"$f":"L67*'CTI Input Sheet'!B28","v":0},{"$f":"L67*'CTI Input Sheet'!C28","v":0},{"$f":"L67*'CTI Input Sheet'!D28","v":0},0,null,null,0,0,0,{"$f":"T67*'CTI Input Sheet'!K22","v":0},{"$f":"SUM(T67*H11)/60","v":0},null,0,0,0,0,0,0,null,{"$f":"SUM(AB67*AH8)+(AC67*AH9)","v":0},0,0,null,{"$f":"Z67*AO6/60","v":0},{"$f":"AB67*AO8/60","v":0},0,0,{"$f":"AN67*AL6","v":0},null,{"$f":"IF(ProjectData!H$17=\"Not Required\",0,B67*2)","v":0},0,0,{"$f":"AQ67*1.39","v":0},{"$f":"+AR67*AW7","v":0},{"$f":"AR67*AT7","v":0},{"$f":"AR67*AU7/60","v":0}]
[null,{"$f":"ProjectData!D65","v":0},null,9,24,4,1.25,1.25,3.75,5.25,0,{"$f":"K68*G11","v":0},{"$f":"K68*G13","v":0},{"$f":"L68*'CTI Input Sheet'!B28","v":0},{"$f":"L68*'CTI Input Sheet'!C28","v":0},{"$f":"L68*'CTI Input Sheet'!D28","v":0},0,null,null,0,0,0,{"$f":"T68*'CTI Input Sheet'!K22","v":0},{"$f":"SUM(T68*H11)/60","v":0},null,0,0,0,0,0,0,null,{"$f":"SUM(AB68*AH8)+(AC68*AH9)","v":0},0,0,null,{"$f":"Z68*AO6/60","v":0},{"$f":"AB68*AO8/60","v":0},0,0,{"$f":"AN68*AL6","v":0},null,{"$f":"IF(ProjectData!H$17=\"Not Required\",0,B68*2)","v":0},0,0,{"$f":"AQ68*2.89","v":0},{"$f":"+AR68*AW7","v":0},{"$f":"AR68*AT7","v":0},{"$f":"AR68*AU7/60","v":0}]
[null,{"$f":"ProjectData!D66","v":0},null,9,36,4,1.25,1.25,4.75,6.25,0,{"$f":"K69*G11","v":0},{"$f":"K69*G13","v":0},{"$f":"L69*'CTI Input Sheet'!B28","v":0},{"$f":"L69*'CTI Input Sheet'!C28","v":0},{"$f":"L69*'CTI Input Sheet'!D28","v":0},0,null,null,0,0,0,{"$f":"T69*'CTI Input Sheet'!K22","v":0},{"$f":"SUM(T69*H11)/60","v":0},null,0,0,0,0,0,0,null,{"$f":"SUM(AB69*AH8)+(AC69*AH9)","v":0},0,0,null,{"$f":"Z69*AO6/60","v":0},{"$f":"AB69*AO8/60","v":0},0,0,{"$f":"AN69*AL6","v":0},null,{"$f":"IF(ProjectData!H$17=\"Not Required\",0,B69*2)","v":0},0,0,{"$f":"AQ69*4.72","v":0},{"$f":"+AR69*AW7","v":0},{"$f":"AR69*AT7","v":0},{"$f":"AR69*AU7/60","v":0}]
[null,{"$f":"ProjectData!D67","v":1},null,12,12,4,1.5,1.5,3,4.5,10.5,{"$f":"K70*G11","v":39.9},{"$f":"K70*G13","v":239.4},{"$f":"L70*'CTI Input Sheet'!B28","v":59.849999999999994},{"$f":"L70*'CTI Input Sheet'!C28","v":9.9749999999999996},{"$f":"L70*'CTI Input Sheet'!D28","v":0},309.22500000000002,null,null,4,39.9,{"$f":"Q70","v":309.22500000000002},{"$f":"T70*'CTI Input Sheet'!K22","v":10},{"$f":"SUM(T70*H11)/60","v":1},null,3,48,4.5,18,0,0,null,{"$f":"SUM(AB70*AH8)+(AC70*AH9)","v":45},0,45,null,{"$f":"Z70*AO6/60","v":0.25},{"$f":"AB70*AO8/60","v":0.15},0,0.4,{"$f":"AN70*AL6","v":30},null,{"$f":"IF(ProjectData!H$17=\"Not Required\",0,B70*2)","v":0},0,0,{"$f":"AQ70*1.82","v":0},{"$f":"+AR70*AW8","v":0},{"$f":"AR70*AT8","v":0},{"$f":"AR70*AU8/60","v":0}]
[null,{"$f":"ProjectData!D68","v":0},null,12,24,4,1.5,1.5,4,5.5,0,{"$f":"K71*G11","v":0},{"$f":"K71*G13","v":0},{"$f":"L71*'CTI Input Sheet'!B28","v":0},{"$f":"L71*'CTI Input Sheet'!C28","v":0},{"$f":"L71*'CTI Input Sheet'!D28","v":0},0,null,null,0,0,0,{"$f":"T71*'CTI Input Sheet'!K22","v":0},{"$f":"SUM(T71*H11)/60","v":0},null,0,0,0,0,0,0,null,{"$f":"SUM(AB71*AH8)+(AC71*AH9)","v":0},0,0,null,{"$f":"Z71*AO6/60","v":0},{"$f":"AB71*AO8/60","v":0},0,0,{"$f":"AN71*AL6","v":0},null,{"$f":"IF(ProjectData!H$17=\"Not Required\",0,B71*2)","v":0},0,0,{"$f":"AQ71*3.56","v":0},{"$f":"+AR71*AW8","v":0},{"$f":"AR71*AT8","v":0},{"$f":"AR71*AU8/60","v":0}]
[null,{"$f":"ProjectData!D69","v":0},null,12,36,4,1.5,1.5,5,6.5,0,{"$f":"K72*G11","v":0},{"$f":"K72*G13","v":0},{"$f":"L72*'CTI Input Sheet'!B28","v":0},{"$f":"L72*'CTI Input Sheet'!C28","v":0},{"$f":"L72*'CTI Input Sheet'!D28","v":0},0,null,null,0,0,0,{"$f":"T72*'CTI Input Sheet'!K22","v":0},{"$f":"SUM(T72*H11)/60","v":0},null,0,0,0,0,0,0,null,{"$f":"SUM(AB72*AH8)+(AC72*AH9)","v":0},0,0,null,{"$f":"Z72*AO6/60","v":0},{"$f":"AB72*AO8/60","v":0},0,0,{"$f":"AN72*AL6","v":0},null,{"$f":"IF(ProjectData!H$17=\"Not Required\",0,B72*2)","v":0},0,0,{"$f":"AQ72*5.63","v":0},{"$f":"+AR72*AW8","v":0},{"$f":"AR72*AT8","v":0},{"$f":"AR72*AU8/60","v":0}]
[null,{"$f":"ProjectData!D70","v":0},null,18,12,4,2,2,3.5,5,0,{"$f":"K73*G11","v":0},{"$f":"K73*G13","v":0},{"$f":"L73*'CTI Input Sheet'!B28","v":0},{"$f":"L73*'CTI Input Sheet'!C28","v":0},{"$f":"L73*'CTI Input Sheet'!D28","v":0},0,null,null,0,0,0,{"$f":"T73*'CTI Input Sheet'!K22","v":0},{"$f":"SUM(T73*H11)/60","v":0},null,0,0,0,0,0,0,null,{"$f":"SUM(AB73*AH8)+(AC73*AH9)","v":0},0,0,null,{"$f":"Z73*AO6/60","v":0},{"$f":"AB73*AO8/60","v":0},0,0,{"$f":"AN73*AL6","v":0},null,{"$f":"IF(ProjectData!H$17=\"Not Required\",0,B73*2)","v":0},0,0,{"$f":"AQ73*2.8","v":0},{"$f":"+AR73*AW9","v":0},{"$f":"AR73*AT9","v":0},{"$f":"AR73*AU9/60","v":0}]
[null,{"$f":"ProjectData!D71","v":0},null,18,24,4,2,2,4.5,6,0,{"$f":"K74*G11","v":0},{"$f":"K74*G13","v":0},{"$f":"L74*'CTI Input Sheet'!B28","v":0},{"$f":"L74*'CTI Input Sheet'!C28","v":0},{"$f":"L74*'CTI Input Sheet'!D28","v":0},0,null,null,0,0,0,{"$f":"T74*'CTI Input Sheet'!K22","v":0},{"$f":"SUM(T74*H11)/60","v":0},null,0,0,0,0,0,0,null,{"$f":"SUM(AB74*AH8)+(AC74*AH9)","v":0},0,0,null,{"$f":"Z74*AO6/60","v":0},{"$f":"AB74*AO8/60","v":0},0,0,{"$f":"AN74*AL6","v":0},null,{"$f":"IF(ProjectData!H$17=\"Not Required\",0,B74*2)","v":0},0,0,{"$f":"AQ74*5.05","v":0},{"$f":"+AR74*AW9","v":0},{"$f":"AR74*AT9","v":0},{"$f":"AR74*AU9/60","v":0}]
[null,{"$f":"ProjectData!D72","v":0},null,18,36,4,2,2,5.5,7,0,{"$f":"K75*G11","v":0},{"$f":"K75*G13","v":0},{"$f":"L75*'CTI Input Sheet'!B28","v":0},{"$f":"L75*'CTI Input Sheet'!C28","v":0},{"$f":"L75*'CTI Input Sheet'!D28","v":0},0,null,null,0,0,0,{"$f":"T75*'CTI Input Sheet'!K22","v":0},{"$f":"SUM(T75*H11)/60","v":0},null,0,0,0,0,0,0,null,{"$f":"SUM(AB75*AH8)+(AC75*AH9)","v":0},0,0,null,{"$f":"Z75*AO6/60","v":0},{"$f":"AB75*AO8/60","v":0},0,0,{"$f":"AN75*AL6","v":0},null,{"$f":"IF(ProjectData!H$17=\"Not Required\",0,B75*2)","v":0},0,0,{"$f":"AQ75*7.62","v":0},{"$f":"+AR75*AW9","v":0},{"$f":"AR75*AT9","v":0},{"$f":"AR75*AU9/60","v":0}]
[null,{"$f":"ProjectData!D73","v":0},null,24,12,4,2.5,2.5,4,5.5,0,{"$f":"K76*G11","v":0},{"$f":"K76*G13","v":0},{"$f":"L76*'CTI Input Sheet'!B28","v":0},{"$f":"L76*'CTI Input Sheet'!C28","v":0},{"$f":"L76*'CTI Input Sheet'!D28","v":0},0,null,null,0,0,0,{"$f":"T76*'CTI Input Sheet'!K22","v":0},{"$f":"SUM(T76*H11)/60","v":0},null,0,0,0,0,0,0,null,{"$f":"SUM(AB76*AH8)+(AC76*AH9)","v":0},0,0,null,{"$f":"Z76*AO6/60","v":0},{"$f":"AB76*AO8/60","v":0},0,0,{"$f":"AN76*AL6","v":0},null,{"$f":"IF(ProjectData!H$17=\"Not Required\",0,B76*2)","v":0},0,0,{"$f":"AQ76*3.96","v":0},{"$f":"+AR76*AW10","v":0},{"$f":"AR76*AT10","v":0},{"$f":"AR76*AU10/60","v":0}]
[null,{"$f":"ProjectData!D74","v":0},null,24,24,4,2.5,2.5,5,6.5,0,{"$f":"K77*G11","v":0},{"$f":"K77*G13","v":0},{"$f":"L77*'CTI Input Sheet'!B28","v":0},{"$f":"L77*'CTI Input Sheet'!C28","v":0},{"$f":"L77*'CTI Input Sheet'!D28","v":0},0,null,null,0,0,0,{"$f":"T77*'CTI Input Sheet'!K22","v":0},{"$f":"SUM(T77*H11)/60","v":0},null,0,0,0,0,0,0,null,{"$f":"SUM(AB77*AH8)+(AC77*AH9)","v":0},0,0,null,{"$f":"Z77*AO6/60","v":0},{"$f":"AB77*AO8/60","v":0},0,0,{"$f":"AN77*AL6","v":0},null,{"$f":"IF(ProjectData!H$17=\"Not Required\",0,B77*2)","v":0},0,0,{"$f":"AQ77*6.73","v":0},{"$f":"+AR77*AW10","v":0},{"$f":"AR77*AT10","v":0},{"$f":"AR77*AU10/60","v":0}]
[null,{"$f":"ProjectData!D75","v":0},null,24,36,4,2.5,2.5,6,7.5,0,{"$f":"K78*G11","v":0},{"$f":"K78*G13","v":0},{"$f":"L78*'CTI Input Sheet'!B28","v":0},{"$f":"L78*'CTI Input Sheet'!C28","v":0},{"$f":"L78*'CTI Input Sheet'!D28","v":0},0,null,null,0,0,0,{"$f":"T78*'CTI Input Sheet'!K22","v":0},{"$f":"SUM(T78*H11)/60","v":0},null,0,0,0,0,0,0,null,{"$f":"SUM(AB78*AH8)+(AC78*AH9)","v":0},0,0,null,{"$f":"Z78*AO6/60","v":0},{"$f":"AB78*AO8/60","v":0},0,0,{"$f":"AN78*AL6","v":0},null,{"$f":"IF(ProjectData!H$17=\"Not Required\",0,B78*2)","v":0},0,0,{"$f":"AQ78*9.82","v":0},{"$f":"+AR78*AW10","v":0},{"$f":"AR78*AT10","v":0},{"$f":"AR78*AU10/60","v":0}]
[null,{"$f":"ProjectData!D76","v":0},null,30,12,4,3,3,4.5,6,0,{"$f":"K79*G11","v":0},{"$f":"K79*G13","v":0},{"$f":"L79*'CTI Input Sheet'!B28","v":0},{"$f":"L79*'CTI Input Sheet'!C28","v":0},{"$f":"L79*'CTI Input Sheet'!D28","v":0},0,null,null,0,0,0,{"$f":"T79*'CTI Input Sheet'!K22","v":0},{"$f":"SUM(T79*H11)/60","v":0},null,0,0,0,0,0,0,null,{"$f":"SUM(AB79*AH8)+(AC79*AH9)","v":0},0,0,null,{"$f":"Z79*AO6/60","v":0},{"$f":"AB79*AO8/60","v":0},0,0,{"$f":"AN79*AL6","v":0},null,{"$f":"IF(ProjectData!H$17=\"Not Required\",0,B79*2)","v":0},0,0,{"$f":"AQ79*5.3","v":0},{"$f":"+AR79*AW11","v":0},{"$f":"AR79*AT11","v":0},{"$f":"AR79*AU11/60","v":0}]
[null,{"$f":"ProjectData!D77","v":0},null,30,24,4,3,3,5.5,7,0,{"$f":"K80*G11","v":0},{"$f":"K80*G13","v":0},{"$f":"L80*'CTI Input Sheet'!B28","v":0},{"$f":"L80*'CTI Input Sheet'!C28","v":0},{"$f":"L80*'CTI Input Sheet'!D28","v":0},0,null,null,0,0,0,{"$f":"T80*'CTI Input Sheet'!K22","v":0},{"$f":"SUM(T80*H11)/60","v":0},null,0,0,0,0,0,0,null,{"$f":"SUM(AB80*AH8)+(AC80*AH9)","v":0},0,0,null,{"$f":"Z80*AO6/60","v":0},{"$f":"AB80*AO8/60","v":0},0,0,{"$f":"AN80*AL6","v":0},null,{"$f":"IF(ProjectData!H$17=\"Not Required\",0,B80*2)","v":0},0,0,{"$f":"AQ80*8.59","v":0},{"$f":"+AR80*AW11","v":0},{"$f":"AR80*AT11","v":0},{"$f":"AR80*AU11/60","v":0}]
[null,{"$f":"ProjectData!D78","v":0},null,30,36,4,3,3,6.5,8,0,{"$f":"K81*G11","v":0},{"$f":"K81*G13","v":0},{"$f":"L81*'CTI Input Sheet'!B28","v":0},{"$f":"L81*'CTI Input Sheet'!C28","v":0},{"$f":"L81*'CTI Input Sheet'!D28","v":0},0,null,null,0,0,0,{"$f":"T81*'CTI Input Sheet'!K22","v":0},{"$f":"SUM(T81*H11)/60","v":0},null,0,0,0,0,0,0,null,{"$f":"SUM(AB81*AH8)+(AC81*AH9)","v":0},0,0,null,{"$f":"Z81*AO6/60","v":0},{"$f":"AB81*AO8/60","v":0},0,0,{"$f":"AN81*AL6","v":0},null,{"$f":"IF(ProjectData!H$17=\"Not Required\",0,B81*2)","v":0},0,0,{"$f":"AQ81*12.2","v":0},{"$f":"+AR81*AW11","v":0},{"$f":"AR81*AT11","v":0},{"$f":"AR81*AU11/60","v":0}]
[null,{"$f":"ProjectData!D79","v":1},null,36,12,4,3.5,3.5,5,6.5,18.5,{"$f":"K82*G11","v":70.3},{"$f":"K82*G13","v":421.8},{"$f":"L82*'CTI Input Sheet'!B28","v":105.44999999999999},{"$f":"L82*'CTI Input Sheet'!C28","v":17.574999999999999},{"$f":"L82*'CTI Input Sheet'!D28","v":0},544.82500000000005,null,null,4,70.3,544.82500000000005,{"$f":"T82*'CTI Input Sheet'!K22","v":10},{"$f":"SUM(T82*H11)/60","v":1},null,3,48,4.5,18,0,0,null,{"$f":"SUM(AB82*AH8)+(AC82*AH9)","v":45},0,45,null,{"$f":"Z82*AO6/60","v":0.25},{"$f":"AB82*AO8/60","v":0.15},0,0.4,{"$f":"AN82*AL6","v":30},null,{"$f":"IF(ProjectData!H$17=\"Not Required\",0,B82*2)","v":0},0,0,{"$f":"AQ82*6.81","v":0},{"$f":"+AR82*AW12","v":0},{"$f":"AR82*AT12","v":0},{"$f":"AR82*AU12/60","v":0}]
[null,{"$f":"ProjectData!D80","v":0},null,36,24,4,3.5,3.5,6,7.5,0,{"$f":"K83*G11","v":0},{"$f":"K83*G13","v":0},{"$f":"L83*'CTI Input Sheet'!B28","v":0},{"$f":"L83*'CTI Input Sheet'!C28","v":0},{"$f":"L83*'CTI Input Sheet'!D28","v":0},0,null,null,0,0,0,{"$f":"T83*'CTI Input Sheet'!K22","v":0},{"$f":"SUM(T83*H11)/60","v":0},null,0,0,0,0,0,0,null,{"$f":"SUM(AB83*AH8)+(AC83*AH9)","v":0},0,0,null,{"$f":"Z83*AO6/60","v":0},{"$f":"AB83*AO8/60","v":0},0,0,{"$f":"AN83*AL6","v":0},null,{"$f":"IF(ProjectData!H$17=\"Not Required\",0,B83*2)","v":0},0,0,{"$f":"AQ83*10.63","v":0},{"$f":"+AR83*AW12","v":0},{"$f":"AR83*AT12","v":0},{"$f":"AR83*AU12/60","v":0}]
[null,{"$f":"ProjectData!D81","v":0},null,36,36,4,3.5,3.5,7,8.5,0,{"$f":"K84*G11","v":0},{"$f":"K84*G13","v":0},{"$f":"L84*'CTI Input Sheet'!B28","v":0},{"$f":"L84*'CTI Input Sheet'!C28","v":0},{"$f":"L84*'CTI Input Sheet'!D28","v":0},{"$f":"SUM(M84:P84)","v":0},null,null,0,0,0,{"$f":"T84*'CTI Input Sheet'!K22","v":0},{"$f":"SUM(T84*H11)/60","v":0},null,0,0,0,0,0,0,null,{"$f":"SUM(AB84*AH8)+(AC84*AH9)","v":0},0,0,null,{"$f":"Z84*AO6/60","v":0},{"$f":"AB84*AO8/60","v":0},0,0,{"$f":"AN84*AL6","v":0},null,{"$f":"IF(ProjectData!H$17=\"Not Required\",0,B84*2)","v":0},0,0,{"$f":"AQ84*14.75","v":0},{"$f":"+AR84*AW12","v":0},{"$f":"AR84*AT12","v":0},{"$f":"AR84*AU12/60","v":0}]
[null,{"$f":"SUM(B64:B84)","v":2},null,null,null,null,null,null,null,null,{"$f":"SUM(K64:K84)","v":29},110.19999999999999,661.2,165.29999999999998,27.549999999999997,0,854.05000000000007,null,null,{"$f":"SUM(T64:T84)","v":8},{"$f":"SUM(U64:U84)","v":110.19999999999999},{"$f":"SUM(V64:V84)","v":854.05000000000007},{"$f":"SUM(W64:W84)","v":20},{"$f":"SUM(X64:X84)","v":2},null,{"$f":"SUM(Z64:Z84)","v":6},96,9,36,0,0,null,{"$f":"SUM(AG64:AG84)","v":90},{"$f":"SUM(AH64:AH84)","v":0},{"$f":"SUM(AI64:AI84)","v":90},null,{"$f":"SUM(AK64:AK84)","v":0.5},{"$f":"SUM(AL64:AL84)","v":0.3},{"$f":"SUM(AM64:AM84)","v":0},{"$f":"SUM(AN64:AN84)","v":0.8},{"$f":"SUM(AO64:AO84)","v":60},null,{"$f":"SUM(AQ64:AQ84)","v":0},0,0,0,0,0,0]
[null,null,null,null,null,null,null,null,null,null,null,null,null,null,null,null,null,null,null,null,null,null,{"$f":"W85*'CTI Input Sheet'!H7","v":1500},{"$f":"X85*'CTI Input Sheet'!H6","v":150},null,null,{"$f":"AA85*AH12","v":72},{"$f":"AB85*AH8","v":45},{"$f":"AC85*AH9","v":45},{"$f":"AD85*AH10","v":0},{"$f":"AE85*AH11","v":0},null,null,null,null,null,{"$f":"AK85*AL6","v":37.5},{"$f":"AL85*AL6","v":22.5},{"$f":"AM85*AL6","v":0}]
[null,"HX Fittings",null,"HX Fittings",null,"NEMA VE 2 : HX Support Quantity - Support Weight - Support Steel, Fabrication, Logistics, Erection Costs",null,null,null,null,null,null,null,null,null,null,null,null,null,"HX : Support Structure Summary",null,null,null,null,null,"HX : Accessory Quantities ",null,null,null,null,null,null,"HX : Tray Accessory Costs ",null,null,null,"HX : Tray Accessory Installation Time & Installation Cost",null,null,null,null,null,"HX Covers"]
[null,"Quantities",null,"HB Width (in)","HB Radius (in) ","Support Quantity","OS1 Str. Section Length (FT)","OS2 Str. Section Length (FT)","OS3 Str. Section Length (FT)","OS4 Str. Section Length (FT)","CTR Str. Section Length (FT)","Total Str. Section Length (FT)","Total Str. Section Weight (lb)","Total Str. Section Cost (USD)","Total Fabrication Cost (USD)","Total Logistic Cost (USD)","Total Erection Cost (USD","SUM TOTAL COST/FITTING",null,"Total Quantity of Supports","Total Weight of Supports (LB)","Total Cost of Supports (USD)","Total Design Time (HOURS)","Total Support Instal Time (HOURS)",null,"Splice Plates Quantity (PRS)","Splice Plate Hardware Quantity (PCS)","Hold Down Clamp Quantity (PRS)","Clamp Hardware Quantity (PCS)","Expansion Guides Quantity (PRS)","Guides Hardware Quantity (PCS)",null,"Hold Down Clamps (PR)","Expansion Guides (PR)","Total Accessory Cost",null,"Splice Plates Time/Pair (HRS)","Hold Down Clamp Time/Pair (HRS)","Exp. Guide Time/Pair (HRS)","Total Time (HOURS)","Total Time Cost (USD)",null,"Cover Quantity (PCS)","Clamp Quantity (PCS)","Hardware Quantity (PCS)","Cover Weight (LBS)","Clamp Weight (LBS)","Clamps Cost (USD)","Installation Time (HRS)"]
[null,{"$f":"ProjectData!G61","v":0},null,6,12,5,1,1,2.5,2.5,5,{"$f":"SUM(G89+H89+I89+J89+K89)*B89","v":0},{"$f":"L89*G11","v":0},{"$f":"L89*G13","v":0},{"$f":"M89*'CTI Input Sheet'!B28","v":0},{"$f":"M89*'CTI Input Sheet'!C28","v":0},{"$f":"M89*'CTI Input Sheet'!D28","v":0},{"$f":"SUM(N89:Q89)","v":0},null,{"$f":"B89*F89","v":0},{"$f":"M89","v":0},{"$f":"R89","v":0},{"$f":"T89*'CTI Input Sheet'!K23","v":0},{"$f":"SUM(T89*H11)/60","v":0},null,{"$f":"B89*4","v":0},{"$f":"Z89*16","v":0},{"$f":"(F89+1)*B89","v":0},{"$f":"AB89*4","v":0},0,0,null,{"$f":"SUM(AB89*AH8)+(AC89*AH9)","v":0},0,{"$f":"SUM(AG89:AH89)","v":0},null,{"$f":"Z89*AO6/60","v":0},{"$f":"AB89*AO8/60","v":0},0,{"$f":"SUM(AK89:AM89)","v":0},{"$f":"AN89*AL6","v":0},null,{"$f":"IF(ProjectData!H$17=\"Not Required\",0,B89*2)","v":0},{"$f":"AQ89*4","v":0},0,{"$f":"AQ89*1.41","v":0},{"$f":"+AR89*AW6","v":0},{"$f":"AR89*AT6","v":0},{"$f":"AR89*AU6/60","v":0}]
[null,{"$f":"ProjectData!G62","v":0},null,6,24,5,1,1,3.5,3.5,7,{"$f":"SUM(G90+H90+I90+J90+K90)*B90","v":0},{"$f":"L90*G11","v":0},{"$f":"L90*G13","v":0},{"$f":"M90*'CTI Input Sheet'!B28","v":0},{"$f":"M90*'CTI Input Sheet'!C28","v":0},{"$f":"M90*'CTI Input Sheet'!D28","v":0},0,null,{"$f":"B90*F90","v":0},0,0,{"$f":"T90*'CTI Input Sheet'!K23","v":0},{"$f":"SUM(T90*H11)/60","v":0},null,0,0,0,0,0,0,null,{"$f":"SUM(AB90*AH8)+(AC90*AH9)","v":0},0,0,null,{"$f":"Z90*AO6/60","v":0},{"$f":"AB90*AO8/60","v":0},0,0,{"$f":"AN90*AL6","v":0},null,{"$f":"IF(ProjectData!H$17=\"Not Required\",0,B90*2)","v":0},0,0,{"$f":"AQ90*3.42","v":0},{"$f":"+AR90*AW6","v":0},{"$f":"AR90*AT6","v":0},{"$f":"AR90*AU6/60","v":0}]
[null,{"$f":"ProjectData!G63","v":0},null,6,36,5,1,1,4.5,4.5,9,0,{"$f":"L91*G11","v":0},{"$f":"L91*G13","v":0},{"$f":"M91*'CTI Input Sheet'!B28","v":0},{"$f":"M91*'CTI Input Sheet'!C28","v":0},{"$f":"M91*'CTI Input Sheet'!D28","v":0},0,null,0,0,0,{"$f":"T91*'CTI Input Sheet'!K23","v":0},{"$f":"SUM(T91*H11)/60","v":0},null,0,0,0,0,0,0,null,{"$f":"SUM(AB91*AH8)+(AC91*AH9)","v":0},0,0,null,{"$f":"Z91*AO6/60","v":0},{"$f":"AB91*AO8/60","v":0},0,0,{"$f":"AN91*AL6","v":0},null,{"$f":"IF(ProjectData!H$17=\"Not Required\",0,B91*2)","v":0},0,0,{"$f":"AQ91*6.13","v":0},{"$f":"+AR91*AW6","v":0},{"$f":"AR91*AT6","v":0},{"$f":"AR91*AU6/60","v":0}]
[null,{"$f":"ProjectData!G64","v":0},null,9,12,5,1.25,1.25,2.75,2.75,5.25,0,{"$f":"L92*G11","v":0},{"$f":"L92*G13","v":0},{"$f":"M92*'CTI Input Sheet'!B28","v":0},{"$f":"M92*'CTI Input Sheet'!C28","v":0},{"$f":"M92*'CTI Input Sheet'!D28","v":0},0,null,0,0,0,{"$f":"T92*'CTI Input Sheet'!K23","v":0},{"$f":"SUM(T92*H11)/60","v":0},null,0,0,0,0,0,0,null,{"$f":"SUM(AB92*AH8)+(AC92*AH9)","v":0},0,0,null,{"$f":"Z92*AO6/60","v":0},{"$f":"AB92*AO8/60","v":0},0,0,{"$f":"AN92*AL6","v":0},null,{"$f":"IF(ProjectData!H$17=\"Not Required\",0,B92*2)","v":0},{"$f":"AQ92*4","v":0},0,{"$f":"AQ92*1.86","v":0},{"$f":"+AR92*AW7","v":0},{"$f":"AR92*AT7","v":0},{"$f":"AR92*AU7/60","v":0}]
[null,{"$f":"ProjectData!G65","v":0},null,9,24,5,1.25,1.25,3.75,3.75,7.25,0,{"$f":"L93*G11","v":0},{"$f":"L93*G13","v":0},{"$f":"M93*'CTI Input Sheet'!B28","v":0},{"$f":"M93*'CTI Input Sheet'!C28","v":0},{"$f":"M93*'CTI Input Sheet'!D28","v":0},0,null,0,0,0,{"$f":"T93*'CTI Input Sheet'!K23","v":0},{"$f":"SUM(T93*H11)/60","v":0},null,0,0,0,0,0,0,null,{"$f":"SUM(AB93*AH8)+(AC93*AH9)","v":0},0,0,null,{"$f":"Z93*AO6/60","v":0},{"$f":"AB93*AO8/60","v":0},0,0,{"$f":"AN93*AL6","v":0},null,{"$f":"IF(ProjectData!H$17=\"Not Required\",0,B93*2)","v":0},0,0,{"$f":"AQ93*4.17","v":0},{"$f":"+AR93*AW7","v":0},{"$f":"AR93*AT7","v":0},{"$f":"AR93*AU7/60","v":0}]
[null,{"$f":"ProjectData!G66","v":0},null,9,36,5,1.25,1.25,4.75,4.75,9.25,0,{"$f":"L94*G11","v":0},{"$f":"L94*G13","v":0},{"$f":"M94*'CTI Input Sheet'!B28","v":0},{"$f":"M94*'CTI Input Sheet'!C28","v":0},{"$f":"M94*'CTI Input Sheet'!D28","v":0},0,null,0,0,0,{"$f":"T94*'CTI Input Sheet'!K23","v":0},{"$f":"SUM(T94*H11)/60","v":0},null,0,0,0,0,0,0,null,{"$f":"SUM(AB94*AH8)+(AC94*AH9)","v":0},0,0,null,{"$f":"Z94*AO6/60","v":0},{"$f":"AB94*AO8/60","v":0},0,0,{"$f":"AN94*AL6","v":0},null,{"$f":"IF(ProjectData!H$17=\"Not Required\",0,B94*2)","v":0},0,0,{"$f":"AQ94*7.16","v":0},{"$f":"+AR94*AW7","v":0},{"$f":"AR94*AT7","v":0},{"$f":"AR94*AU7/60","v":0}]
[null,{"$f":"ProjectData!G67","v":0},null,12,12,5,1.5,1.5,3,3,5.5,0,{"$f":"L95*G11","v":0},{"$f":"L95*G13","v":0},{"$f":"M95*'CTI Input Sheet'!B28","v":0},{"$f":"M95*'CTI Input Sheet'!C28","v":0},{"$f":"M95*'CTI Input Sheet'!D28","v":0},0,null,0,0,0,{"$f":"T95*'CTI Input Sheet'!K23","v":0},{"$f":"SUM(T95*H11)/60","v":0},null,0,0,0,0,0,0,null,{"$f":"SUM(AB95*AH8)+(AC95*AH9)","v":0},0,0,null,{"$f":"Z95*AO6/60","v":0},{"$f":"AB95*AO8/60","v":0},0,0,{"$f":"AN95*AL6","v":0},null,{"$f":"IF(ProjectData!H$17=\"Not Required\",0,B95*2)","v":0},{"$f":"AQ95*4","v":0},0,{"$f":"AQ95*2.36","v":0},{"$f":"+AR95*AW8","v":0},{"$f":"AR95*AT8","v":0},{"$f":"AR95*AU8/60","v":0}]
[null,{"$f":"ProjectData!G68","v":0},null,12,24,5,1.5,1.5,4,4,7.5,0,{"$f":"L96*G11","v":0},{"$f":"L96*G13","v":0},{"$f":"M96*'CTI Input Sheet'!B28","v":0},{"$f":"M96*'CTI Input Sheet'!C28","v":0},{"$f":"M96*'CTI Input Sheet'!D28","v":0},0,null,0,0,0,{"$f":"T96*'CTI Input Sheet'!K23","v":0},{"$f":"SUM(T96*H11)/60","v":0},null,0,0,0,0,0,0,null,{"$f":"SUM(AB96*AH8)+(AC96*AH9)","v":0},0,0,null,{"$f":"Z96*AO6/60","v":0},{"$f":"AB96*AO8/60","v":0},0,0,{"$f":"AN96*AL6","v":0},null,{"$f":"IF(ProjectData!H$17=\"Not Required\",0,B96*2)","v":0},0,0,{"$f":"AQ96*5","v":0},{"$f":"+AR96*AW8","v":0},{"$f":"AR96*AT8","v":0},{"$f":"AR96*AU8/60","v":0}]
[null,{"$f":"ProjectData!G69","v":0},null,12,36,5,1.5,1.5,5,5,9.5,0,{"$f":"L97*G11","v":0},{"$f":"L97*G13","v":0},{"$f":"M97*'CTI Input Sheet'!B28","v":0},{"$f":"M97*'CTI Input Sheet'!C28","v":0},{"$f":"M97*'CTI Input Sheet'!D28","v":0},0,null,0,0,0,{"$f":"T97*'CTI Input Sheet'!K23","v":0},{"$f":"SUM(T97*H11)/60","v":0},null,0,0,0,0,0,0,null,{"$f":"SUM(AB97*AH8)+(AC97*AH9)","v":0},0,0,null,{"$f":"Z97*AO6/60","v":0},{"$f":"AB97*AO8/60","v":0},0,0,{"$f":"AN97*AL6","v":0},null,{"$f":"IF(ProjectData!H$17=\"Not Required\",0,B97*2)","v":0},0,0,{"$f":"AQ97*8.29","v":0},{"$f":"+AR97*AW8","v":0},{"$f":"AR97*AT8","v":0},{"$f":"AR97*AU8/60","v":0}]
[null,{"$f":"ProjectData!G70","v":0},null,18,12,5,2,2,3.5,3.5,6,0,{"$f":"L98*G11","v":0},{"$f":"L98*G13","v":0},{"$f":"M98*'CTI Input Sheet'!B28","v":0},{"$f":"M98*'CTI Input Sheet'!C28","v":0},{"$f":"M98*'CTI Input Sheet'!D28","v":0},0,null,0,0,0,{"$f":"T98*'CTI Input Sheet'!K23","v":0},{"$f":"SUM(T98*H11)/60","v":0},null,0,0,0,0,0,0,null,{"$f":"SUM(AB98*AH8)+(AC98*AH9)","v":0},0,0,null,{"$f":"Z98*AO6/60","v":0},{"$f":"AB98*AO8/60","v":0},0,0,{"$f":"AN98*AL6","v":0},null,{"$f":"IF(ProjectData!H$17=\"Not Required\",0,B98*2)","v":0},{"$f":"AQ98*4","v":0},0,{"$f":"AQ98*3.5","v":0},{"$f":"+AR98*AW9","v":0},{"$f":"AR98*AT9","v":0},{"$f":"AR98*AU9/60","v":0}]
[null,{"$f":"ProjectData!G71","v":0},null,18,24,5,2,2,4.5,4.5,8,0,{"$f":"L99*G11","v":0},{"$f":"L99*G13","v":0},{"$f":"M99*'CTI Input Sheet'!B28","v":0},{"$f":"M99*'CTI Input Sheet'!C28","v":0},{"$f":"M99*'CTI Input Sheet'!D28","v":0},0,null,0,0,0,{"$f":"T99*'CTI Input Sheet'!K23","v":0},{"$f":"SUM(T99*H11)/60","v":0},null,0,0,0,0,0,0,null,{"$f":"SUM(AB99*AH8)+(AC99*AH9)","v":0},0,0,null,{"$f":"Z99*AO6/60","v":0},{"$f":"AB99*AO8/60","v":0},0,0,{"$f":"AN99*AL6","v":0},null,{"$f":"IF(ProjectData!H$17=\"Not Required\",0,B99*2)","v":0},0,0,{"$f":"AQ99*6.81","v":0},{"$f":"+AR99*AW9","v":0},{"$f":"AR99*AT9","v":0},{"$f":"AR99*AU9/60","v":0}]
[null,{"$f":"ProjectData!G72","v":0},null,18,36,5,2,2,5.5,5.5,10,0,{"$f":"L100*G11","v":0},{"$f":"L100*G13","v":0},{"$f":"M100*'CTI Input Sheet'!B28","v":0},{"$f":"M100*'CTI Input Sheet'!C28","v":0},{"$f":"M100*'CTI Input Sheet'!D28","v":0},0,null,0,0,0,{"$f":"T100*'CTI Input Sheet'!K23","v":0},{"$f":"SUM(T100*H11)/60","v":0},null,0,0,0,0,0,0,null,{"$f":"SUM(AB100*AH8)+(AC100*AH9)","v":0},0,0,null,{"$f":"Z100*AO6/60","v":0},{"$f":"AB100*AO8/60","v":0},0,0,{"$f":"AN100*AL6","v":0},null,{"$f":"IF(ProjectData!H$17=\"Not Required\",0,B100*2)","v":0},0,0,{"$f":"AQ100*10.76","v":0},{"$f":"+AR100*AW9","v":0},{"$f":"AR100*AT9","v":0},{"$f":"AR100*AU9/60","v":0}]
[null,{"$f":"ProjectData!G73","v":0},null,24,12,5,2.5,2.5,4,4,7,0,{"$f":"L101*G11","v":0},{"$f":"L101*G13","v":0},{"$f":"M101*'CTI Input Sheet'!B28","v":0},{"$f":"M101*'CTI Input Sheet'!C28","v":0},{"$f":"M101*'CTI Input Sheet'!D28","v":0},0,null,0,0,0,{"$f":"T101*'CTI Input Sheet'!K23","v":0},{"$f":"SUM(T101*H11)/60","v":0},null,0,0,0,0,0,0,null,{"$f":"SUM(AB101*AH8)+(AC101*AH9)","v":0},0,0,null,{"$f":"Z101*AO6/60","v":0},{"$f":"AB101*AO8/60","v":0},0,0,{"$f":"AN101*AL6","v":0},null,{"$f":"IF(ProjectData!H$17=\"Not Required\",0,B101*2)","v":0},{"$f":"AQ101*4","v":0},0,{"$f":"AQ101*4.83","v":0},{"$f":"+AR101*AW10","v":0},{"$f":"AR101*AT10","v":0},{"$f":"AR101*AU10/60","v":0}]
[null,{"$f":"ProjectData!G74","v":0},null,24,24,5,2.5,2.5,5,5,9,0,{"$f":"L102*G11","v":0},{"$f":"L102*G13","v":0},{"$f":"M102*'CTI Input Sheet'!B28","v":0},{"$f":"M102*'CTI Input Sheet'!C28","v":0},{"$f":"M102*'CTI Input Sheet'!D28","v":0},0,null,0,0,0,{"$f":"T102*'CTI Input Sheet'!K23","v":0},{"$f":"SUM(T102*H11)/60","v":0},null,0,0,0,0,0,0,null,{"$f":"SUM(AB102*AH8)+(AC102*AH9)","v":0},0,0,null,{"$f":"Z102*AO6/60","v":0},{"$f":"AB102*AO8/60","v":0},0,0,{"$f":"AN102*AL6","v":0},null,{"$f":"IF(ProjectData!H$17=\"Not Required\",0,B102*2)","v":0},0,0,{"$f":"AQ102*8.83","v":0},{"$f":"+AR102*AW10","v":0},{"$f":"AR102*AT10","v":0},{"$f":"AR102*AU10/60","v":0}]
[null,{"$f":"ProjectData!G75","v":0},null,24,36,5,2.5,2.5,6,6,11,0,{"$f":"L103*G11","v":0},{"$f":"L103*G13","v":0},{"$f":"M103*'CTI Input Sheet'!B28","v":0},{"$f":"M103*'CTI Input Sheet'!C28","v":0},{"$f":"M103*'CTI Input Sheet'!D28","v":0},0,null,0,0,0,{"$f":"T103*'CTI Input Sheet'!K23","v":0},{"$f":"SUM(T103*H11)/60","v":0},null,0,0,0,0,0,0,null,{"$f":"SUM(AB103*AH8)+(AC103*AH9)","v":0},0,0,null,{"$f":"Z103*AO6/60","v":0},{"$f":"AB103*AO8/60","v":0},0,0,{"$f":"AN103*AL6","v":0},null,{"$f":"IF(ProjectData!H$17=\"Not Required\",0,B103*2)","v":0},0,0,{"$f":"AQ103*13.45","v":0},{"$f":"+AR103*AW10","v":0},{"$f":"AR103*AT10","v":0},{"$f":"AR103*AU10/60","v":0}]
[null,{"$f":"ProjectData!G76","v":0},null,30,12,5,3,3,4.5,4.5,8,0,{"$f":"L104*G11","v":0},{"$f":"L104*G13","v":0},{"$f":"M104*'CTI Input Sheet'!B28","v":0},{"$f":"M104*'CTI Input Sheet'!C28","v":0},{"$f":"M104*'CTI Input Sheet'!D28","v":0},0,null,0,0,0,{"$f":"T104*'CTI Input Sheet'!K23","v":0},{"$f":"SUM(T104*H11)/60","v":0},null,0,0,0,0,0,0,null,{"$f":"SUM(AB104*AH8)+(AC104*AH9)","v":0},0,0,null,{"$f":"Z104*AO6/60","v":0},{"$f":"AB104*AO8/60","v":0},0,0,{"$f":"AN104*AL6","v":0},null,{"$f":"IF(ProjectData!H$17=\"Not Required\",0,B104*2)","v":0},{"$f":"AQ104*4","v":0},0,{"$f":"AQ104*6.33","v":0},{"$f":"+AR104*AW11","v":0},{"$f":"AR104*AT11","v":0},{"$f":"AR104*AU11/60","v":0}]
[null,{"$f":"ProjectData!G77","v":0},null,30,24,5,3,3,5.5,5.5,10,0,{"$f":"L105*G11","v":0},{"$f":"L105*G13","v":0},{"$f":"M105*'CTI Input Sheet'!B28","v":0},{"$f":"M105*'CTI Input Sheet'!C28","v":0},{"$f":"M105*'CTI Input Sheet'!D28","v":0},0,null,0,0,0,{"$f":"T105*'CTI Input Sheet'!K23","v":0},{"$f":"SUM(T105*H11)/60","v":0},null,0,0,0,0,0,0,null,{"$f":"SUM(AB105*AH8)+(AC105*AH9)","v":0},0,0,null,{"$f":"Z105*AO6/60","v":0},{"$f":"AB105*AO8/60","v":0},0,0,{"$f":"AN105*AL6","v":0},null,{"$f":"IF(ProjectData!H$17=\"Not Required\",0,B105*2)","v":0},0,0,{"$f":"AQ105*11.03","v":0},{"$f":"+AR105*AW11","v":0},{"$f":"AR105*AT11","v":0},{"$f":"AR105*AU11/60","v":0}]
[null,{"$f":"ProjectData!G78","v":0},null,30,36,5,3,3,6.5,6.5,12,0,{"$f":"L106*G11","v":0},{"$f":"L106*G13","v":0},{"$f":"M106*'CTI Input Sheet'!B28","v":0},{"$f":"M106*'CTI Input Sheet'!C28","v":0},{"$f":"M106*'CTI Input Sheet'!D28","v":0},0,null,0,0,0,{"$f":"T106*'CTI Input Sheet'!K23","v":0},{"$f":"SUM(T106*H11)/60","v":0},null,0,0,0,0,0,0,null,{"$f":"SUM(AB106*AH8)+(AC106*AH9)","v":0},0,0,null,{"$f":"Z106*AO6/60","v":0},{"$f":"AB106*AO8/60","v":0},0,0,{"$f":"AN106*AL6","v":0},null,{"$f":"IF(ProjectData!H$17=\"Not Required\",0,B106*2)","v":0},0,0,{"$f":"AQ106*16.34","v":0},{"$f":"+AR106*AW11","v":0},{"$f":"AR106*AT11","v":0},{"$f":"AR106*AU11/60","v":0}]
[null,{"$f":"ProjectData!G79","v":0},null,36,12,5,3.5,3.5,5,5,9,0,{"$f":"L107*G11","v":0},{"$f":"L107*G13","v":0},{"$f":"M107*'CTI Input Sheet'!B28","v":0},{"$f":"M107*'CTI Input Sheet'!C28","v":0},{"$f":"M107*'CTI Input Sheet'!D28","v":0},0,null,0,0,0,{"$f":"T107*'CTI Input Sheet'!K23","v":0},{"$f":"SUM(T107*H11)/60","v":0},null,0,0,0,0,0,0,null,{"$f":"SUM(AB107*AH8)+(AC107*AH9)","v":0},0,0,null,{"$f":"Z107*AO6/60","v":0},{"$f":"AB107*AO8/60","v":0},0,0,{"$f":"AN107*AL6","v":0},null,{"$f":"IF(ProjectData!H$17=\"Not Required\",0,B107*2)","v":0},{"$f":"AQ107*4","v":0},0,{"$f":"AQ107*8.01","v":0},{"$f":"+AR107*AW12","v":0},{"$f":"AR107*AT12","v":0},{"$f":"AR107*AU12/60","v":0}]
[null,{"$f":"ProjectData!G80","v":0},null,36,24,5,3.5,3.5,6,6,11,0,{"$f":"L108*G11","v":0},{"$f":"L108*G13","v":0},{"$f":"M108*'CTI Input Sheet'!B28","v":0},{"$f":"M108*'CTI Input Sheet'!C28","v":0},{"$f":"M108*'CTI Input Sheet'!D28","v":0},0,null,0,0,0,{"$f":"T108*'CTI Input Sheet'!K23","v":0},{"$f":"SUM(T108*H11)/60","v":0},null,0,0,0,0,0,0,null,{"$f":"SUM(AB108*AH8)+(AC108*AH9)","v":0},0,0,null,{"$f":"Z108*AO6/60","v":0},{"$f":"AB108*AO8/60","v":0},0,0,{"$f":"AN108*AL6","v":0},null,{"$f":"IF(ProjectData!H$17=\"Not Required\",0,B108*2)","v":0},{"$f":"AQ108*4","v":0},{"$f":"AR108*4","v":0},{"$f":"AQ108*13.4","v":0},{"$f":"+AR108*AW12","v":0},{"$f":"AR108*AT12","v":0},{"$f":"AR108*AU12/60","v":0}]
[null,{"$f":"ProjectData!G81","v":0},null,36,36,5,3.5,3.5,7,7,13,{"$f":"SUM(G109+H109+I109+J109+K109)*B109","v":0},{"$f":"L109*G11","v":0},{"$f":"L109*G13","v":0},{"$f":"M109*'CTI Input Sheet'!B28","v":0},{"$f":"M109*'CTI Input Sheet'!C28","v":0},{"$f":"M109*'CTI Input Sheet'!D28","v":0},0,null,0,0,0,{"$f":"T109*'CTI Input Sheet'!K23","v":0},{"$f":"SUM(T109*H11)/60","v":0},null,0,0,0,0,0,0,null,{"$f":"SUM(AB109*AH8)+(AC109*AH9)","v":0},0,0,null,{"$f":"Z109*AO6/60","v":0},{"$f":"AB109*AO8/60","v":0},0,0,{"$f":"AN109*AL6","v":0},null,{"$f":"IF(ProjectData!H$17=\"Not Required\",0,B109*2)","v":0},0,0,{"$f":"AQ109*19.4","v":0},{"$f":"+AR109*AW12","v":0},{"$f":"AR109*AT12","v":0},{"$f":"AR109*AU12/60","v":0}]
[null,{"$f":"SUM(B89:B109)","v":0},null,null,null,null,null,null,null,null,null,{"$f":"SUM(L89:L109)","v":0},0,0,0,0,0,0,null,{"$f":"SUM(T89:T109)","v":0},{"$f":"SUM(U89:U109)","v":0},{"$f":"SUM(V89:V109)","v":0},{"$f":"SUM(W89:W109)","v":0},{"$f":"SUM(X89:X109)","v":0},null,{"$f":"SUM(Z89:Z109)","v":0},0,0,0,0,0,null,{"$f":"SUM(AG89:AG109)","v":0},{"$f":"SUM(AH89:AH109)","v":0},{"$f":"SUM(AI89:AI109)","v":0},null,{"$f":"SUM(AK89:AK109)","v":0},{"$f":"SUM(AL89:AL109)","v":0},{"$f":"SUM(AM89:AM109)","v":0},{"$f":"SUM(AN89:AN109)","v":0},{"$f":"SUM(AO89:AO109)","v":0},null,{"$f":"SUM(AQ89:AQ109)","v":0},0,0,0,0,0,0]
[null,null,null,null,null,null,null,null,null,null,null,null,null,null,null,null,null,null,null,null,null,null,{"$f":"W110*'CTI Input Sheet'!H7","v":0},{"$f":"X110*'CTI Input Sheet'!H6","v":0},null,null,{"$f":"AA110*AH12","v":0},{"$f":"AB110*AH8","v":0},{"$f":"AC110*AH9","v":0},{"$f":"AD110*AH10","v":0},{"$f":"AE110*AH11","v":0},null,null,null,null,null,{"$f":"AK110*AL6","v":0},{"$f":"AL110*AL6","v":0},{"$f":"AM110*AL6","v":0}]
[null,"Vertical VI Fittings",null,"Vertical VI Fittings",null,"NEMA VE 2 : Vertical VI Support Quantity - Support Weight - Support Steel, Fabrication, Logistics, Erection Costs",null,null,null,null,null,null,null,null,null,null,null,null,null,"VI : Support Structure Summary",null,null,null,null,null,"VI : Accessory Quantities ",null,null,null,null,null,null,"Vertical VI : Tray Accessory Costs ",null,null,null,"Vertical VI : Tray Accessory Installation Time & Installation Cost",null,null,null,null,null,"VI Covers"]
[null,"Quantities",null,"HB Width (in)","HB Radius (in) ","Support Quantity","OS1 Str. Section Length (FT)","OS2 Str. Section Length (FT)","Total Str. Section Length (FT)","Total Str. Section Weight (lb)","Total Str. Section Cost (USD)","Total Fabrication Cost (USD)","Total Logistic Cost (USD)","Total Erection Cost (USD","SUM TOTAL COST/FITTING",null,null,null,null,"Total Quantity of Supports","Total Weight of Supports (LB)","Total Cost of Supports (USD)","Total Design Time (HOURS)","Total Support Instal Time (HOURS)",null,"Splice Plates Quantity (PRS)","Splice Plate Hardware Quantity (PCS)","Hold Down Clamp Quantity (PRS)","Clamp Hardware Quantity (PCS)","Expansion Guides Quantity (PRS)","Guides Hardware Quantity (PCS)",null,"Hold Down Clamps (PR)","Expansion Guides (PR)","Total Accessory Cost",null,"Splice Plates Time/Pair (HRS)","Hold Down Clamp Time/Pair (HRS)","Exp. Guide Time/Pair (HRS)","Total Time (HOURS)","Total Time Cost (USD)",null,"Cover Quantity (PCS)","Clamp Quantity (PCS)","Hardware Quantity (PCS)","Cover Weight (LBS)","Clamp Weight (LBS)","Clamps Cost (USD)","Installation Time (HRS)"]
[null,{"$f":"ProjectData!G37","v":0},null,6,12,2,1,3,{"$f":"SUM(G114+H114)*B114","v":0},{"$f":"I114*G11","v":0},{"$f":"I114*G13","v":0},{"$f":"J114*'CTI Input Sheet'!B28","v":0},{"$f":"J114*'CTI Input Sheet'!C28","v":0},{"$f":"J114*'CTI Input Sheet'!D28","v":0},{"$f":"SUM(L114:N114)","v":0},null,null,null,null,{"$f":"B114*F114","v":0},{"$f":"J114","v":0},{"$f":"O114","v":0},{"$f":"T114*'CTI Input Sheet'!K24","v":0},{"$f":"SUM(T114*H11)/60","v":0},null,{"$f":"B114*2","v":0},{"$f":"Z114*16","v":0},{"$f":"(F114)*B114","v":0},{"$f":"AB114*4","v":0},0,0,null,{"$f":"SUM(AB114*AH8)+(AC114*AH9)","v":0},0,{"$f":"SUM(AG114:AH114)","v":0},null,{"$f":"Z114*AO6/60","v":0},{"$f":"AB114*AO8/60","v":0},0,{"$f":"SUM(AK114:AM114)","v":0},{"$f":"AN114*AL6","v":0},null,{"$f":"IF(ProjectData!H$17=\"Not Required\",0,B114*2)","v":0},{"$f":"AQ114*2","v":0},{"$f":"AR114*4","v":0},{"$f":"AQ114*0.45","v":0},{"$f":"+AR114*AW6","v":0},{"$f":"AR114*AT6","v":0},{"$f":"AR114*AU6/60","v":0}]
[null,{"$f":"ProjectData!G38","v":0},null,6,24,2,1,5,{"$f":"SUM(G115+H115)*B115","v":0},{"$f":"I115*G11","v":0},{"$f":"I115*G13","v":0},{"$f":"J115*'CTI Input Sheet'!B28","v":0},{"$f":"J115*'CTI Input Sheet'!C28","v":0},{"$f":"J115*'CTI Input Sheet'!D28","v":0},0,null,null,null,null,{"$f":"B115*F115","v":0},0,0,{"$f":"T115*'CTI Input Sheet'!K24","v":0},{"$f":"SUM(T115*H11)/60","v":0},null,0,0,0,0,0,0,null,{"$f":"SUM(AB115*AH8)+(AC115*AH9)","v":0},0,0,null,{"$f":"Z115*AO6/60","v":0},{"$f":"AB115*AO8/60","v":0},0,0,{"$f":"AN115*AL6","v":0},null,{"$f":"IF(ProjectData!H$17=\"Not Required\",0,B115*2)","v":0},0,0,{"$f":"AQ115*0.73","v":0},{"$f":"+AR115*AW6","v":0},{"$f":"AR115*AT6","v":0},{"$f":"AR115*AU6/60","v":0}]
[null,{"$f":"ProjectData!G39","v":0},null,6,36,2,1,7,0,{"$f":"I116*G11","v":0},{"$f":"I116*G13","v":0},{"$f":"J116*'CTI Input Sheet'!B28","v":0},{"$f":"J116*'CTI Input Sheet'!C28","v":0},{"$f":"J116*'CTI Input Sheet'!D28","v":0},0,null,null,null,null,0,0,0,{"$f":"T116*'CTI Input Sheet'!K24","v":0},{"$f":"SUM(T116*H11)/60","v":0},null,0,0,0,0,0,0,null,{"$f":"SUM(AB116*AH8)+(AC116*AH9)","v":0},0,0,null,{"$f":"Z116*AO6/60","v":0},{"$f":"AB116*AO8/60","v":0},0,0,{"$f":"AN116*AL6","v":0},null,{"$f":"IF(ProjectData!H$17=\"Not Required\",0,B116*2)","v":0},0,0,{"$f":"AQ116*1.12","v":0},{"$f":"+AR116*AW6","v":0},{"$f":"AR116*AT6","v":0},{"$f":"AR116*AU6/60","v":0}]
[null,{"$f":"ProjectData!G40","v":0},null,9,12,2,1.25,3.25,0,{"$f":"I117*G11","v":0},{"$f":"I117*G13","v":0},{"$f":"J117*'CTI Input Sheet'!B28","v":0},{"$f":"J117*'CTI Input Sheet'!C28","v":0},{"$f":"J117*'CTI Input Sheet'!D28","v":0},0,null,null,null,null,0,0,0,{"$f":"T117*'CTI Input Sheet'!K24","v":0},{"$f":"SUM(T117*H11)/60","v":0},null,0,0,0,0,0,0,null,{"$f":"SUM(AB117*AH8)+(AC117*AH9)","v":0},0,0,null,{"$f":"Z117*AO6/60","v":0},{"$f":"AB117*AO8/60","v":0},0,0,{"$f":"AN117*AL6","v":0},null,{"$f":"IF(ProjectData!H$17=\"Not Required\",0,B117*2)","v":0},0,0,{"$f":"AQ117*0.45","v":0},{"$f":"+AR117*AW7","v":0},{"$f":"AR117*AT7","v":0},{"$f":"AR117*AU7/60","v":0}]
[null,{"$f":"ProjectData!G41","v":0},null,9,24,2,1.25,5.25,0,{"$f":"I118*G11","v":0},{"$f":"I118*G13","v":0},{"$f":"J118*'CTI Input Sheet'!B28","v":0},{"$f":"J118*'CTI Input Sheet'!C28","v":0},{"$f":"J118*'CTI Input Sheet'!D28","v":0},0,null,null,null,null,0,0,0,{"$f":"T118*'CTI Input Sheet'!K24","v":0},{"$f":"SUM(T118*H11)/60","v":0},null,0,0,0,0,0,0,null,{"$f":"SUM(AB118*AH8)+(AC118*AH9)","v":0},0,0,null,{"$f":"Z118*AO6/60","v":0},{"$f":"AB118*AO8/60","v":0},0,0,{"$f":"AN118*AL6","v":0},null,{"$f":"IF(ProjectData!H$17=\"Not Required\",0,B118*2)","v":0},0,0,{"$f":"AQ118*0.98","v":0},{"$f":"+AR118*AW7","v":0},{"$f":"AR118*AT7","v":0},{"$f":"AR118*AU7/60","v":0}]
[null,{"$f":"ProjectData!G42","v":0},null,9,36,2,1.25,7.25,0,{"$f":"I119*G11","v":0},{"$f":"I119*G13","v":0},{"$f":"J119*'CTI Input Sheet'!B28","v":0},{"$f":"J119*'CTI Input Sheet'!C28","v":0},{"$f":"J119*'CTI Input Sheet'!D28","v":0},0,null,null,null,null,0,0,0,{"$f":"T119*'CTI Input Sheet'!K24","v":0},{"$f":"SUM(T119*H11)/60","v":0},null,0,0,0,0,0,0,null,{"$f":"SUM(AB119*AH8)+(AC119*AH9)","v":0},0,0,null,{"$f":"Z119*AO6/60","v":0},{"$f":"AB119*AO8/60","v":0},0,0,{"$f":"AN119*AL6","v":0},null,{"$f":"IF(ProjectData!H$17=\"Not Required\",0,B119*2)","v":0},0,0,{"$f":"AQ119*1.51","v":0},{"$f":"+AR119*AW7","v":0},{"$f":"AR119*AT7","v":0},{"$f":"AR119*AU7/60","v":0}]
[null,{"$f":"ProjectData!G43","v":4},null,12,12,2,1.5,3.5,20,{"$f":"I120*G11","v":76},{"$f":"I120*G13","v":456},{"$f":"J120*'CTI Input Sheet'!B28","v":114},{"$f":"J120*'CTI Input Sheet'!C28","v":19},{"$f":"J120*'CTI Input Sheet'!D28","v":0},133,null,null,null,null,8,76,133,{"$f":"T120*'CTI Input Sheet'!K24","v":12},{"$f":"SUM(T120*H11)/60","v":2},null,8,128,8,32,0,0,null,{"$f":"SUM(AB120*AH8)+(AC120*AH9)","v":80},0,80,null,{"$f":"Z120*AO6/60","v":0.66666666666666663},{"$f":"AB120*AO8/60","v":0.26666666666666666},0,0.93333333333333335,{"$f":"AN120*AL6","v":70},null,{"$f":"IF(ProjectData!H$17=\"Not Required\",0,B120*2)","v":0},0,0,{"$f":"AQ120*0.57","v":0},{"$f":"+AR120*AW8","v":0},{"$f":"AR120*AT8","v":0},{"$f":"AR120*AU8/60","v":0}]
[null,{"$f":"ProjectData!G44","v":0},null,12,24,2,1.5,5.5,0,{"$f":"I121*G11","v":0},{"$f":"I121*G13","v":0},{"$f":"J121*'CTI Input Sheet'!B28","v":0},{"$f":"J121*'CTI Input Sheet'!C28","v":0},{"$f":"J121*'CTI Input Sheet'!D28","v":0},0,null,null,null,null,0,0,0,{"$f":"T121*'CTI Input Sheet'!K24","v":0},{"$f":"SUM(T121*H11)/60","v":0},null,0,0,0,0,0,0,null,{"$f":"SUM(AB121*AH8)+(AC121*AH9)","v":0},0,0,null,{"$f":"Z121*AO6/60","v":0},{"$f":"AB121*AO8/60","v":0},0,0,{"$f":"AN121*AL6","v":0},null,{"$f":"IF(ProjectData!H$17=\"Not Required\",0,B121*2)","v":0},0,0,{"$f":"AQ121*1.23","v":0},{"$f":"+AR121*AW8","v":0},{"$f":"AR121*AT8","v":0},{"$f":"AR121*AU8/60","v":0}]
[null,{"$f":"ProjectData!G45","v":0},null,12,36,2,1.5,7.5,0,{"$f":"I122*G11","v":0},{"$f":"I122*G13","v":0},{"$f":"J122*'CTI Input Sheet'!B28","v":0},{"$f":"J122*'CTI Input Sheet'!C28","v":0},{"$f":"J122*'CTI Input Sheet'!D28","v":0},0,null,null,null,null,0,0,0,{"$f":"T122*'CTI Input Sheet'!K24","v":0},{"$f":"SUM(T122*H11)/60","v":0},null,0,0,0,0,0,0,null,{"$f":"SUM(AB122*AH8)+(AC122*AH9)","v":0},0,0,null,{"$f":"Z122*AO6/60","v":0},{"$f":"AB122*AO8/60","v":0},0,0,{"$f":"AN122*AL6","v":0},null,{"$f":"IF(ProjectData!H$17=\"Not Required\",0,B122*2)","v":0},0,0,{"$f":"AQ122*1.9","v":0},{"$f":"+AR122*AW8","v":0},{"$f":"AR122*AT8","v":0},{"$f":"AR122*AU8/60","v":0}]
[null,{"$f":"ProjectData!G46","v":0},null,18,12,2,2,4,0,{"$f":"I123*G11","v":0},{"$f":"I123*G13","v":0},{"$f":"J123*'CTI Input Sheet'!B28","v":0},{"$f":"J123*'CTI Input Sheet'!C28","v":0},{"$f":"J123*'CTI Input Sheet'!D28","v":0},0,null,null,null,null,0,0,0,{"$f":"T123*'CTI Input Sheet'!K24","v":0},{"$f":"SUM(T123*H11)/60","v":0},null,0,0,0,0,0,0,null,{"$f":"SUM(AB123*AH8)+(AC123*AH9)","v":0},0,0,null,{"$f":"Z123*AO6/60","v":0},{"$f":"AB123*AO8/60","v":0},0,0,{"$f":"AN123*AL6","v":0},null,{"$f":"IF(ProjectData!H$17=\"Not Required\",0,B123*2)","v":0},0,0,{"$f":"AQ123*0.8","v":0},{"$f":"+AR123*AW9","v":0},{"$f":"AR123*AT9","v":0},{"$f":"AR123*AU9/60","v":0}]
[null,{"$f":"ProjectData!G47","v":0},null,18,24,2,2,6,0,{"$f":"I124*G11","v":0},{"$f":"I124*G13","v":0},{"$f":"J124*'CTI Input Sheet'!B28","v":0},{"$f":"J124*'CTI Input Sheet'!C28","v":0},{"$f":"J124*'CTI Input Sheet'!D28","v":0},0,null,null,null,null,0,0,0,{"$f":"T124*'CTI Input Sheet'!K24","v":0},{"$f":"SUM(T124*H11)/60","v":0},null,0,0,0,0,0,0,null,{"$f":"SUM(AB124*AH8)+(AC124*AH9)","v":0},0,0,null,{"$f":"Z124*AO6/60","v":0},{"$f":"AB124*AO8/60","v":0},0,0,{"$f":"AN124*AL6","v":0},null,{"$f":"IF(ProjectData!H$17=\"Not Required\",0,B124*2)","v":0},0,0,{"$f":"AQ124*1.74","v":0},{"$f":"+AR124*AW9","v":0},{"$f":"AR124*AT9","v":0},{"$f":"AR124*AU9/60","v":0}]
[null,{"$f":"ProjectData!G48","v":0},null,18,36,2,2,8,0,{"$f":"I125*G11","v":0},{"$f":"I125*G13","v":0},{"$f":"J125*'CTI Input Sheet'!B28","v":0},{"$f":"J125*'CTI Input Sheet'!C28","v":0},{"$f":"J125*'CTI Input Sheet'!D28","v":0},0,null,null,null,null,0,0,0,{"$f":"T125*'CTI Input Sheet'!K24","v":0},{"$f":"SUM(T125*H11)/60","v":0},null,0,0,0,0,0,0,null,{"$f":"SUM(AB125*AH8)+(AC125*AH9)","v":0},0,0,null,{"$f":"Z125*AO6/60","v":0},{"$f":"AB125*AO8/60","v":0},0,0,{"$f":"AN125*AL6","v":0},null,{"$f":"IF(ProjectData!H$17=\"Not Required\",0,B125*2)","v":0},0,0,{"$f":"AQ125*2.68","v":0},{"$f":"+AR125*AW9","v":0},{"$f":"AR125*AT9","v":0},{"$f":"AR125*AU9/60","v":0}]
[null,{"$f":"ProjectData!G49","v":0},null,24,12,2,2.5,4.5,0,{"$f":"I126*G11","v":0},{"$f":"I126*G13","v":0},{"$f":"J126*'CTI Input Sheet'!B28","v":0},{"$f":"J126*'CTI Input Sheet'!C28","v":0},{"$f":"J126*'CTI Input Sheet'!D28","v":0},0,null,null,null,null,0,0,0,{"$f":"T126*'CTI Input Sheet'!K24","v":0},{"$f":"SUM(T126*H11)/60","v":0},null,0,0,0,0,0,0,null,{"$f":"SUM(AB126*AH8)+(AC126*AH9)","v":0},0,0,null,{"$f":"Z126*AO6/60","v":0},{"$f":"AB126*AO8/60","v":0},0,0,{"$f":"AN126*AL6","v":0},null,{"$f":"IF(ProjectData!H$17=\"Not Required\",0,B126*2)","v":0},{"$f":"AQ126*3","v":0},0,{"$f":"AQ126*1.04","v":0},{"$f":"+AR126*AW10","v":0},{"$f":"AR126*AT10","v":0},{"$f":"AR126*AU10/60","v":0}]
[null,{"$f":"ProjectData!G50","v":0},null,24,24,2,2.5,6.5,0,{"$f":"I127*G11","v":0},{"$f":"I127*G13","v":0},{"$f":"J127*'CTI Input Sheet'!B28","v":0},{"$f":"J127*'CTI Input Sheet'!C28","v":0},{"$f":"J127*'CTI Input Sheet'!D28","v":0},0,null,null,null,null,0,0,0,{"$f":"T127*'CTI Input Sheet'!K24","v":0},{"$f":"SUM(T127*H11)/60","v":0},null,0,0,0,0,0,0,null,{"$f":"SUM(AB127*AH8)+(AC127*AH9)","v":0},0,0,null,{"$f":"Z127*AO6/60","v":0},{"$f":"AB127*AO8/60","v":0},0,0,{"$f":"AN127*AL6","v":0},null,{"$f":"IF(ProjectData!H$17=\"Not Required\",0,B127*2)","v":0},0,0,{"$f":"AQ127*2.25","v":0},{"$f":"+AR127*AW10","v":0},{"$f":"AR127*AT10","v":0},{"$f":"AR127*AU10/60","v":0}]
[null,{"$f":"ProjectData!G51","v":0},null,24,36,2,2.5,8.5,0,{"$f":"I128*G11","v":0},{"$f":"I128*G13","v":0},{"$f":"J128*'CTI Input Sheet'!B28","v":0},{"$f":"J128*'CTI Input Sheet'!C28","v":0},{"$f":"J128*'CTI Input Sheet'!D28","v":0},0,null,null,null,null,0,0,0,{"$f":"T128*'CTI Input Sheet'!K24","v":0},{"$f":"SUM(T128*H11)/60","v":0},null,0,0,0,0,0,0,null,{"$f":"SUM(AB128*AH8)+(AC128*AH9)","v":0},0,0,null,{"$f":"Z128*AO6/60","v":0},{"$f":"AB128*AO8/60","v":0},0,0,{"$f":"AN128*AL6","v":0},null,{"$f":"IF(ProjectData!H$17=\"Not Required\",0,B128*2)","v":0},0,0,{"$f":"AQ128*3.46","v":0},{"$f":"+AR128*AW10","v":0},{"$f":"AR128*AT10","v":0},{"$f":"AR128*AU10/60","v":0}]
[null,{"$f":"ProjectData!G52","v":0},null,30,12,2,3,5,0,{"$f":"I129*G11","v":0},{"$f":"I129*G13","v":0},{"$f":"J129*'CTI Input Sheet'!B28","v":0},{"$f":"J129*'CTI Input Sheet'!C28","v":0},{"$f":"J129*'CTI Input Sheet'!D28","v":0},0,null,null,null,null,0,0,0,{"$f":"T129*'CTI Input Sheet'!K24","v":0},{"$f":"SUM(T129*H11)/60","v":0},null,0,0,0,0,0,0,null,{"$f":"SUM(AB129*AH8)+(AC129*AH9)","v":0},0,0,null,{"$f":"Z129*AO6/60","v":0},{"$f":"AB129*AO8/60","v":0},0,0,{"$f":"AN129*AL6","v":0},null,{"$f":"IF(ProjectData!H$17=\"Not Required\",0,B129*2)","v":0},0,0,{"$f":"AQ129*1.27","v":0},{"$f":"+AR129*AW11","v":0},{"$f":"AR129*AT11","v":0},{"$f":"AR129*AU11/60","v":0}]
[null,{"$f":"ProjectData!G53","v":0},null,30,24,2,3,7,0,{"$f":"I130*G11","v":0},{"$f":"I130*G13","v":0},{"$f":"J130*'CTI Input Sheet'!B28","v":0},{"$f":"J130*'CTI Input Sheet'!C28","v":0},{"$f":"J130*'CTI Input Sheet'!D28","v":0},0,null,null,null,null,0,0,0,{"$f":"T130*'CTI Input Sheet'!K24","v":0},{"$f":"SUM(T130*H11)/60","v":0},null,0,0,0,0,0,0,null,{"$f":"SUM(AB130*AH8)+(AC130*AH9)","v":0},0,0,null,{"$f":"Z130*AO6/60","v":0},{"$f":"AB130*AO8/60","v":0},0,0,{"$f":"AN130*AL6","v":0},null,{"$f":"IF(ProjectData!H$17=\"Not Required\",0,B130*2)","v":0},0,0,{"$f":"AQ130*2.76","v":0},{"$f":"+AR130*AW11","v":0},{"$f":"AR130*AT11","v":0},{"$f":"AR130*AU11/60","v":0}]
[null,{"$f":"ProjectData!G54","v":0},null,30,36,2,3,9,0,{"$f":"I131*G11","v":0},{"$f":"I131*G13","v":0},{"$f":"J131*'CTI Input Sheet'!B28","v":0},{"$f":"J131*'CTI Input Sheet'!C28","v":0},{"$f":"J131*'CTI Input Sheet'!D28","v":0},0,null,null,null,null,0,0,0,{"$f":"T131*'CTI Input Sheet'!K24","v":0},{"$f":"SUM(T131*H11)/60","v":0},null,0,0,0,0,0,0,null,{"$f":"SUM(AB131*AH8)+(AC131*AH9)","v":0},0,0,null,{"$f":"Z131*AO6/60","v":0},{"$f":"AB131*AO8/60","v":0},0,0,{"$f":"AN131*AL6","v":0},null,{"$f":"IF(ProjectData!H$17=\"Not Required\",0,B131*2)","v":0},0,0,{"$f":"AQ131*4.25","v":0},{"$f":"+AR131*AW11","v":0},{"$f":"AR131*AT11","v":0},{"$f":"AR131*AU11/60","v":0}]
[null,{"$f":"ProjectData!G55","v":2},null,36,12,2,3.5,5.5,18,{"$f":"I132*G11","v":68.399999999999991},{"$f":"I132*G13","v":410.40000000000003},{"$f":"J132*'CTI Input Sheet'!B28","v":102.6},{"$f":"J132*'CTI Input Sheet'!C28","v":17.099999999999998},{"$f":"J132*'CTI Input Sheet'!D28","v":0},119.69999999999999,null,null,null,null,4,68.399999999999991,119.69999999999999,{"$f":"T132*'CTI Input Sheet'!K24","v":6},{"$f":"SUM(T132*H11)/60","v":1},null,4,64,4,16,0,0,null,{"$f":"SUM(AB132*AH8)+(AC132*AH9)","v":40},0,40,null,{"$f":"Z132*AO6/60","v":0.33333333333333331},{"$f":"AB132*AO8/60","v":0.13333333333333333},0,0.46666666666666667,{"$f":"AN132*AL6","v":35},null,{"$f":"IF(ProjectData!H$17=\"Not Required\",0,B132*2)","v":0},0,0,{"$f":"AQ132*1.51","v":0},{"$f":"+AR132*AW12","v":0},{"$f":"AR132*AT12","v":0},{"$f":"AR132*AU12/60","v":0}]
[null,{"$f":"ProjectData!G56","v":0},null,36,24,2,3.5,7.5,0,{"$f":"I133*G11","v":0},{"$f":"I133*G13","v":0},{"$f":"J133*'CTI Input Sheet'!B28","v":0},{"$f":"J133*'CTI Input Sheet'!C28","v":0},{"$f":"J133*'CTI Input Sheet'!D28","v":0},0,null,null,null,null,0,0,0,{"$f":"T133*'CTI Input Sheet'!K24","v":0},{"$f":"SUM(T133*H11)/60","v":0},null,0,0,0,0,0,0,null,{"$f":"SUM(AB133*AH8)+(AC133*AH9)","v":0},0,0,null,{"$f":"Z133*AO6/60","v":0},{"$f":"AB133*AO8/60","v":0},0,0,{"$f":"AN133*AL6","v":0},null,{"$f":"IF(ProjectData!H$17=\"Not Required\",0,B133*2)","v":0},0,0,{"$f":"AQ133*3.27","v":0},{"$f":"+AR133*AW12","v":0},{"$f":"AR133*AT12","v":0},{"$f":"AR133*AU12/60","v":0}]
[null,{"$f":"ProjectData!G57","v":0},null,36,36,2,3.5,9.3000000000000007,0,{"$f":"I134*G11","v":0},{"$f":"I134*G13","v":0},{"$f":"J134*'CTI Input Sheet'!B28","v":0},{"$f":"J134*'CTI Input Sheet'!C28","v":0},{"$f":"J134*'CTI Input Sheet'!D28","v":0},{"$f":"SUM(L134:N134)","v":0},null,null,null,null,0,0,0,{"$f":"T134*'CTI Input Sheet'!K24","v":0},{"$f":"SUM(T134*H11)/60","v":0},null,0,0,0,0,0,0,null,{"$f":"SUM(AB134*AH8)+(AC134*AH9)","v":0},0,0,null,{"$f":"Z134*AO6/60","v":0},{"$f":"AB134*AO8/60","v":0},0,0,{"$f":"AN134*AL6","v":0},null,{"$f":"IF(ProjectData!H$17=\"Not Required\",0,B134*2)","v":0},0,0,{"$f":"AQ134*5.03","v":0},{"$f":"+AR134*AW12","v":0},{"$f":"AR134*AT12","v":0},{"$f":"AR134*AU12/60","v":0}]
[null,{"$f":"SUM(B114:B134)","v":6},null,null,null,null,null,null,{"$f":"SUM(I114:I134)","v":38},144.39999999999998,866.40000000000009,216.6,36.099999999999994,0,252.7,null,null,null,null,{"$f":"SUM(T114:T134)","v":12},{"$f":"SUM(U114:U134)","v":144.39999999999998},{"$f":"SUM(V114:V134)","v":252.7},{"$f":"SUM(W114:W134)","v":18},{"$f":"SUM(X114:X134)","v":3},null,{"$f":"SUM(Z114:Z134)","v":12},192,12,48,0,0,null,{"$f":"SUM(AG114:AG134)","v":120},{"$f":"SUM(AH114:AH134)","v":0},{"$f":"SUM(AI114:AI134)","v":120},null,{"$f":"SUM(AK114:AK134)","v":1},{"$f":"SUM(AL114:AL134)","v":0.4},{"$f":"SUM(AM114:AM134)","v":0},{"$f":"SUM(AN114:AN134)","v":1.4},{"$f":"SUM(AO114:AO134)","v":105},null,{"$f":"SUM(AQ114:AQ134)","v":0},0,0,0,0,0,0]
[null,null,null,null,null,null,null,null,null,null,null,null,null,null,null,null,null,null,null,null,null,null,{"$f":"W135*'CTI Input Sheet'!H7","v":1350},{"$f":"X135*'CTI Input Sheet'!H6","v":225},null,null,{"$f":"AA135*AH12","v":144},{"$f":"AB135*AH8","v":60},{"$f":"AC135*AH9","v":60},{"$f":"AD135*AH10","v":0},{"$f":"AE135*AH11","v":0},null,null,null,null,null,{"$f":"AK135*AL6","v":75},{"$f":"AL135*AL6","v":30},{"$f":"AM135*AL6","v":0}]
[null,"Vertical VO Fittings",null,"Vertical VO Fittings",null,"NEMA VE 2 : Vertical VO Support Quantity - Support Weight - Support Steel, Fabrication, Logistics, Erection Costs",null,null,null,null,null,null,null,null,null,null,null,null,null,"VO : Support Structure Summary",null,null,null,null,null,"VO : Accessory Quantities ",null,null,null,null,null,null,"Vertical VO : Tray Accessory Costs ",null,null,null,"Vertical VO : Tray Accessory Installation Time & Installation Cost",null,null,null,null,null,"VO Covers"]
[null,"Quantities",null,"HB Width (in)","HB Radius (in) ","Support Quantity","OS1 Str. Section Length (FT)","OS2 Str. Section Length (FT)","Total Str. Section Length (FT)","Total Str. Section Weight (lb)","Total Str. Section Cost (USD)","Total Fabrication Cost (USD)","Total Logistic Cost (USD)","Total Erection Cost (USD","SUM TOTAL COST/FITTING",null,null,null,null,"Total Quantity of Supports","Total Weight of Supports (LB)","Total Cost of Supports (USD)","Total Design Time (HOURS)","Total Support Instal Time (HOURS)",null,"Splice Plates Quantity (PRS)","Splice Plate Hardware Quantity (PCS)","Hold Down Clamp Quantity (PRS)","Clamp Hardware Quantity (PCS)","Expansion Guides Quantity (PRS)","Guides Hardware Quantity (PCS)",null,"Hold Down Clamps (PR)","Expansion Guides (PR)","Total Accessory Cost",null,"Splice Plates Time/Pair (HRS)","Hold Down Clamp Time/Pair (HRS)","Exp. Guide Time/Pair (HRS)","Total Time (HOURS)","Total Time Cost (USD)",null,"Cover Quantity (PCS)","Clamp Quantity (PCS)","Hardware Quantity (PCS)","Cover Weight (LBS)","Clamp Weight (LBS)","Clamps Cost (USD)","Installation Time (HRS)"]
[null,{"$f":"ProjectData!J37","v":0},null,6,12,2,1,3,{"$f":"SUM(G139+H139)*B139","v":0},{"$f":"I139*G11","v":0},{"$f":"I139*G13","v":0},{"$f":"J139*'CTI Input Sheet'!B28","v":0},{"$f":"J139*'CTI Input Sheet'!C28","v":0},{"$f":"J139*'CTI Input Sheet'!D28","v":0},{"$f":"SUM(L139:N139)","v":0},null,null,null,null,{"$f":"B139*F139","v":0},{"$f":"J139","v":0},{"$f":"O139","v":0},{"$f":"T139*'CTI Input Sheet'!K24","v":0},{"$f":"SUM(T139*H11)/60","v":0},null,{"$f":"B139*2","v":0},{"$f":"Z139*16","v":0},{"$f":"(F139)*B139","v":0},{"$f":"AB139*4","v":0},0,0,null,{"$f":"SUM(AB139*AH8)+(AC139*AH9)","v":0},0,{"$f":"SUM(AG139:AH139)","v":0},null,{"$f":"Z139*AO6/60","v":0},{"$f":"AB139*AO8/60","v":0},0,{"$f":"SUM(AK139:AM139)","v":0},{"$f":"AN139*AL6","v":0},null,{"$f":"IF(ProjectData!H$17=\"Not Required\",0,B139*2)","v":0},{"$f":"AQ139*2","v":0},{"$f":"AR139*4","v":0},{"$f":"AQ139*0.64","v":0},{"$f":"+AR139*AW6","v":0},{"$f":"AR139*AT6","v":0},{"$f":"AR139*AU6/60","v":0}]
[null,{"$f":"ProjectData!J38","v":0},null,6,24,2,1,5,0,{"$f":"I140*G11","v":0},{"$f":"I140*G13","v":0},{"$f":"J140*'CTI Input Sheet'!B28","v":0},{"$f":"J140*'CTI Input Sheet'!C28","v":0},{"$f":"J140*'CTI Input Sheet'!D28","v":0},0,null,null,null,null,0,0,0,{"$f":"T140*'CTI Input Sheet'!K24","v":0},{"$f":"SUM(T140*H11)/60","v":0},null,0,0,0,0,0,0,null,{"$f":"SUM(AB140*AH8)+(AC140*AH9)","v":0},0,0,null,{"$f":"Z140*AO6/60","v":0},{"$f":"AB140*AO8/60","v":0},0,0,{"$f":"AN140*AL6","v":0},null,{"$f":"IF(ProjectData!H$17=\"Not Required\",0,B140*2)","v":0},0,0,{"$f":"AQ140*1.03","v":0},{"$f":"+AR140*AW6","v":0},{"$f":"AR140*AT6","v":0},{"$f":"AR140*AU6/60","v":0}]
[null,{"$f":"ProjectData!J39","v":0},null,6,36,2,1,7,0,{"$f":"I141*G11","v":0},{"$f":"I141*G13","v":0},{"$f":"J141*'CTI Input Sheet'!B28","v":0},{"$f":"J141*'CTI Input Sheet'!C28","v":0},{"$f":"J141*'CTI Input Sheet'!D28","v":0},0,null,null,null,null,0,0,0,{"$f":"T141*'CTI Input Sheet'!K24","v":0},{"$f":"SUM(T141*H11)/60","v":0},null,0,0,0,0,0,0,null,{"$f":"SUM(AB141*AH8)+(AC141*AH9)","v":0},0,0,null,{"$f":"Z141*AO6/60","v":0},{"$f":"AB141*AO8/60","v":0},0,0,{"$f":"AN141*AL6","v":0},null,{"$f":"IF(ProjectData!H$17=\"Not Required\",0,B141*2)","v":0},0,0,{"$f":"AQ141*1.42","v":0},{"$f":"+AR141*AW6","v":0},{"$f":"AR141*AT6","v":0},{"$f":"AR141*AU6/60","v":0}]
[null,{"$f":"ProjectData!J40","v":0},null,9,12,2,1.25,3.25,0,{"$f":"I142*G11","v":0},{"$f":"I142*G13","v":0},{"$f":"J142*'CTI Input Sheet'!B28","v":0},{"$f":"J142*'CTI Input Sheet'!C28","v":0},{"$f":"J142*'CTI Input Sheet'!D28","v":0},0,null,null,null,null,0,0,0,{"$f":"T142*'CTI Input Sheet'!K24","v":0},{"$f":"SUM(T142*H11)/60","v":0},null,0,0,0,0,0,0,null,{"$f":"SUM(AB142*AH8)+(AC142*AH9)","v":0},0,0,null,{"$f":"Z142*AO6/60","v":0},{"$f":"AB142*AO8/60","v":0},0,0,{"$f":"AN142*AL6","v":0},null,{"$f":"IF(ProjectData!H$17=\"Not Required\",0,B142*2)","v":0},0,0,{"$f":"AQ142*0.86","v":0},{"$f":"+AR142*AW7","v":0},{"$f":"AR142*AT7","v":0},{"$f":"AR142*AU7/60","v":0}]
[null,{"$f":"ProjectData!J41","v":0},null,9,24,2,1.25,5.25,0,{"$f":"I143*G11","v":0},{"$f":"I143*G13","v":0},{"$f":"J143*'CTI Input Sheet'!B28","v":0},{"$f":"J143*'CTI Input Sheet'!C28","v":0},{"$f":"J143*'CTI Input Sheet'!D28","v":0},0,null,null,null,null,0,0,0,{"$f":"T143*'CTI Input Sheet'!K24","v":0},{"$f":"SUM(T143*H11)/60","v":0},null,0,0,0,0,0,0,null,{"$f":"SUM(AB143*AH8)+(AC143*AH9)","v":0},0,0,null,{"$f":"Z143*AO6/60","v":0},{"$f":"AB143*AO8/60","v":0},0,0,{"$f":"AN143*AL6","v":0},null,{"$f":"IF(ProjectData!H$17=\"Not Required\",0,B143*2)","v":0},0,0,{"$f":"AQ143*1.38","v":0},{"$f":"+AR143*AW7","v":0},{"$f":"AR143*AT7","v":0},{"$f":"AR143*AU7/60","v":0}]
[null,{"$f":"ProjectData!J42","v":0},null,9,36,2,1.25,7.25,0,{"$f":"I144*G11","v":0},{"$f":"I144*G13","v":0},{"$f":"J144*'CTI Input Sheet'!B28","v":0},{"$f":"J144*'CTI Input Sheet'!C28","v":0},{"$f":"J144*'CTI Input Sheet'!D28","v":0},0,null,null,null,null,0,0,0,{"$f":"T144*'CTI Input Sheet'!K24","v":0},{"$f":"SUM(T144*H11)/60","v":0},null,0,0,0,0,0,0,null,{"$f":"SUM(AB144*AH8)+(AC144*AH9)","v":0},0,0,null,{"$f":"Z144*AO6/60","v":0},{"$f":"AB144*AO8/60","v":0},0,0,{"$f":"AN144*AL6","v":0},null,{"$f":"IF(ProjectData!H$17=\"Not Required\",0,B144*2)","v":0},0,0,{"$f":"AQ144*1.91","v":0},{"$f":"+AR144*AW7","v":0},{"$f":"AR144*AT7","v":0},{"$f":"AR144*AU7/60","v":0}]
[null,{"$f":"ProjectData!J43","v":4},null,12,12,2,1.5,3.5,20,{"$f":"I145*G11","v":76},{"$f":"I145*G13","v":456},{"$f":"J145*'CTI Input Sheet'!B28","v":114},{"$f":"J145*'CTI Input Sheet'!C28","v":19},{"$f":"J145*'CTI Input Sheet'!D28","v":0},133,null,null,null,null,8,76,133,{"$f":"T145*'CTI Input Sheet'!K24","v":12},{"$f":"SUM(T145*H11)/60","v":2},null,8,128,8,32,0,0,null,{"$f":"SUM(AB145*AH8)+(AC145*AH9)","v":80},0,80,null,{"$f":"Z145*AO6/60","v":0.66666666666666663},{"$f":"AB145*AO8/60","v":0.26666666666666666},0,0.93333333333333335,{"$f":"AN145*AL6","v":70},null,{"$f":"IF(ProjectData!H$17=\"Not Required\",0,B145*2)","v":0},0,0,{"$f":"AQ145*1.08","v":0},{"$f":"+AR145*AW8","v":0},{"$f":"AR145*AT8","v":0},{"$f":"AR145*AU8/60","v":0}]
[null,{"$f":"ProjectData!J44","v":0},null,12,24,2,1.5,5.5,0,{"$f":"I146*G11","v":0},{"$f":"I146*G13","v":0},{"$f":"J146*'CTI Input Sheet'!B28","v":0},{"$f":"J146*'CTI Input Sheet'!C28","v":0},{"$f":"J146*'CTI Input Sheet'!D28","v":0},0,null,null,null,null,0,0,0,{"$f":"T146*'CTI Input Sheet'!K24","v":0},{"$f":"SUM(T146*H11)/60","v":0},null,0,0,0,0,0,0,null,{"$f":"SUM(AB146*AH8)+(AC146*AH9)","v":0},0,0,null,{"$f":"Z146*AO6/60","v":0},{"$f":"AB146*AO8/60","v":0},0,0,{"$f":"AN146*AL6","v":0},null,{"$f":"IF(ProjectData!H$17=\"Not Required\",0,B146*2)","v":0},0,0,{"$f":"AQ146*1.74","v":0},{"$f":"+AR146*AW8","v":0},{"$f":"AR146*AT8","v":0},{"$f":"AR146*AU8/60","v":0}]
[null,{"$f":"ProjectData!J45","v":0},null,12,36,2,1.5,7.5,0,{"$f":"I147*G11","v":0},{"$f":"I147*G13","v":0},{"$f":"J147*'CTI Input Sheet'!B28","v":0},{"$f":"J147*'CTI Input Sheet'!C28","v":0},{"$f":"J147*'CTI Input Sheet'!D28","v":0},0,null,null,null,null,0,0,0,{"$f":"T147*'CTI Input Sheet'!K24","v":0},{"$f":"SUM(T147*H11)/60","v":0},null,0,0,0,0,0,0,null,{"$f":"SUM(AB147*AH8)+(AC147*AH9)","v":0},0,0,null,{"$f":"Z147*AO6/60","v":0},{"$f":"AB147*AO8/60","v":0},0,0,{"$f":"AN147*AL6","v":0},null,{"$f":"IF(ProjectData!H$17=\"Not Required\",0,B147*2)","v":0},0,0,{"$f":"AQ147*2.41","v":0},{"$f":"+AR147*AW8","v":0},{"$f":"AR147*AT8","v":0},{"$f":"AR147*AU8/60","v":0}]
[null,{"$f":"ProjectData!J46","v":0},null,18,12,2,2,4,0,{"$f":"I148*G11","v":0},{"$f":"I148*G13","v":0},{"$f":"J148*'CTI Input Sheet'!B28","v":0},{"$f":"J148*'CTI Input Sheet'!C28","v":0},{"$f":"J148*'CTI Input Sheet'!D28","v":0},0,null,null,null,null,0,0,0,{"$f":"T148*'CTI Input Sheet'!K24","v":0},{"$f":"SUM(T148*H11)/60","v":0},null,0,0,0,0,0,0,null,{"$f":"SUM(AB148*AH8)+(AC148*AH9)","v":0},0,0,null,{"$f":"Z148*AO6/60","v":0},{"$f":"AB148*AO8/60","v":0},0,0,{"$f":"AN148*AL6","v":0},null,{"$f":"IF(ProjectData!H$17=\"Not Required\",0,B148*2)","v":0},0,0,{"$f":"AQ148*1.52","v":0},{"$f":"+AR148*AW9","v":0},{"$f":"AR148*AT9","v":0},{"$f":"AR148*AU9/60","v":0}]
[null,{"$f":"ProjectData!J47","v":0},null,18,24,2,2,6,0,{"$f":"I149*G11","v":0},{"$f":"I149*G13","v":0},{"$f":"J149*'CTI Input Sheet'!B28","v":0},{"$f":"J149*'CTI Input Sheet'!C28","v":0},{"$f":"J149*'CTI Input Sheet'!D28","v":0},0,null,null,null,null,0,0,0,{"$f":"T149*'CTI Input Sheet'!K24","v":0},{"$f":"SUM(T149*H11)/60","v":0},null,0,0,0,0,0,0,null,{"$f":"SUM(AB149*AH8)+(AC149*AH9)","v":0},0,0,null,{"$f":"Z149*AO6/60","v":0},{"$f":"AB149*AO8/60","v":0},0,0,{"$f":"AN149*AL6","v":0},null,{"$f":"IF(ProjectData!H$17=\"Not Required\",0,B149*2)","v":0},0,0,{"$f":"AQ149*2.46","v":0},{"$f":"+AR149*AW9","v":0},{"$f":"AR149*AT9","v":0},{"$f":"AR149*AU9/60","v":0}]
[null,{"$f":"ProjectData!J48","v":0},null,18,36,2,2,8,0,{"$f":"I150*G11","v":0},{"$f":"I150*G13","v":0},{"$f":"J150*'CTI Input Sheet'!B28","v":0},{"$f":"J150*'CTI Input Sheet'!C28","v":0},{"$f":"J150*'CTI Input Sheet'!D28","v":0},0,null,null,null,null,0,0,0,{"$f":"T150*'CTI Input Sheet'!K24","v":0},{"$f":"SUM(T150*H11)/60","v":0},null,0,0,0,0,0,0,null,{"$f":"SUM(AB150*AH8)+(AC150*AH9)","v":0},0,0,null,{"$f":"Z150*AO6/60","v":0},{"$f":"AB150*AO8/60","v":0},0,0,{"$f":"AN150*AL6","v":0},null,{"$f":"IF(ProjectData!H$17=\"Not Required\",0,B150*2)","v":0},0,0,{"$f":"AQ150*3.4","v":0},{"$f":"+AR150*AW9","v":0},{"$f":"AR150*AT9","v":0},{"$f":"AR150*AU9/60","v":0}]
[null,{"$f":"ProjectData!J49","v":0},null,24,12,2,2.5,4.5,0,{"$f":"I151*G11","v":0},{"$f":"I151*G13","v":0},{"$f":"J151*'CTI Input Sheet'!B28","v":0},{"$f":"J151*'CTI Input Sheet'!C28","v":0},{"$f":"J151*'CTI Input Sheet'!D28","v":0},0,null,null,null,null,0,0,0,{"$f":"T151*'CTI Input Sheet'!K24","v":0},{"$f":"SUM(T151*H11)/60","v":0},null,0,0,0,0,0,0,null,{"$f":"SUM(AB151*AH8)+(AC151*AH9)","v":0},0,0,null,{"$f":"Z151*AO6/60","v":0},{"$f":"AB151*AO8/60","v":0},0,0,{"$f":"AN151*AL6","v":0},null,{"$f":"IF(ProjectData!H$17=\"Not Required\",0,B151*2)","v":0},{"$f":"AQ151*3","v":0},0,{"$f":"AQ151*1.96","v":0},{"$f":"+AR151*AW10","v":0},{"$f":"AR151*AT10","v":0},{"$f":"AR151*AU10/60","v":0}]
[null,{"$f":"ProjectData!J50","v":0},null,24,24,2,2.5,6.5,0,{"$f":"I152*G11","v":0},{"$f":"I152*G13","v":0},{"$f":"J152*'CTI Input Sheet'!B28","v":0},{"$f":"J152*'CTI Input Sheet'!C28","v":0},{"$f":"J152*'CTI Input Sheet'!D28","v":0},0,null,null,null,null,0,0,0,{"$f":"T152*'CTI Input Sheet'!K24","v":0},{"$f":"SUM(T152*H11)/60","v":0},null,0,0,0,0,0,0,null,{"$f":"SUM(AB152*AH8)+(AC152*AH9)","v":0},0,0,null,{"$f":"Z152*AO6/60","v":0},{"$f":"AB152*AO8/60","v":0},0,0,{"$f":"AN152*AL6","v":0},null,{"$f":"IF(ProjectData!H$17=\"Not Required\",0,B152*2)","v":0},0,0,{"$f":"AQ152*3.18","v":0},{"$f":"+AR152*AW10","v":0},{"$f":"AR152*AT10","v":0},{"$f":"AR152*AU10/60","v":0}]
[null,{"$f":"ProjectData!J51","v":0},null,24,36,2,2.5,8.5,0,{"$f":"I153*G11","v":0},{"$f":"I153*G13","v":0},{"$f":"J153*'CTI Input Sheet'!B28","v":0},{"$f":"J153*'CTI Input Sheet'!C28","v":0},{"$f":"J153*'CTI Input Sheet'!D28","v":0},0,null,null,null,null,0,0,0,{"$f":"T153*'CTI Input Sheet'!K24","v":0},{"$f":"SUM(T153*H11)/60","v":0},null,0,0,0,0,0,0,null,{"$f":"SUM(AB153*AH8)+(AC153*AH9)","v":0},0,0,null,{"$f":"Z153*AO6/60","v":0},{"$f":"AB153*AO8/60","v":0},0,0,{"$f":"AN153*AL6","v":0},null,{"$f":"IF(ProjectData!H$17=\"Not Required\",0,B153*2)","v":0},0,0,{"$f":"AQ153*4.39","v":0},{"$f":"+AR153*AW10","v":0},{"$f":"AR153*AT10","v":0},{"$f":"AR153*AU10/60","v":0}]
[null,{"$f":"ProjectData!J52","v":0},null,30,12,2,3,5,0,{"$f":"I154*G11","v":0},{"$f":"I154*G13","v":0},{"$f":"J154*'CTI Input Sheet'!B28","v":0},{"$f":"J154*'CTI Input Sheet'!C28","v":0},{"$f":"J154*'CTI Input Sheet'!D28","v":0},0,null,null,null,null,0,0,0,{"$f":"T154*'CTI Input Sheet'!K24","v":0},{"$f":"SUM(T154*H11)/60","v":0},null,0,0,0,0,0,0,null,{"$f":"SUM(AB154*AH8)+(AC154*AH9)","v":0},0,0,null,{"$f":"Z154*AO6/60","v":0},{"$f":"AB154*AO8/60","v":0},0,0,{"$f":"AN154*AL6","v":0},null,{"$f":"IF(ProjectData!H$17=\"Not Required\",0,B154*2)","v":0},0,0,{"$f":"AQ154*2.41","v":0},{"$f":"+AR154*AW11","v":0},{"$f":"AR154*AT11","v":0},{"$f":"AR154*AU11/60","v":0}]
[null,{"$f":"ProjectData!J53","v":0},null,30,24,2,3,7,0,{"$f":"I155*G11","v":0},{"$f":"I155*G13","v":0},{"$f":"J155*'CTI Input Sheet'!B28","v":0},{"$f":"J155*'CTI Input Sheet'!C28","v":0},{"$f":"J155*'CTI Input Sheet'!D28","v":0},0,null,null,null,null,0,0,0,{"$f":"T155*'CTI Input Sheet'!K24","v":0},{"$f":"SUM(T155*H11)/60","v":0},null,0,0,0,0,0,0,null,{"$f":"SUM(AB155*AH8)+(AC155*AH9)","v":0},0,0,null,{"$f":"Z155*AO6/60","v":0},{"$f":"AB155*AO8/60","v":0},0,0,{"$f":"AN155*AL6","v":0},null,{"$f":"IF(ProjectData!H$17=\"Not Required\",0,B155*2)","v":0},0,0,{"$f":"AQ155*3.9","v":0},{"$f":"+AR155*AW11","v":0},{"$f":"AR155*AT11","v":0},{"$f":"AR155*AU11/60","v":0}]
[null,{"$f":"ProjectData!J54","v":0},null,30,36,2,3,9,0,{"$f":"I156*G11","v":0},{"$f":"I156*G13","v":0},{"$f":"J156*'CTI Input Sheet'!B28","v":0},{"$f":"J156*'CTI Input Sheet'!C28","v":0},{"$f":"J156*'CTI Input Sheet'!D28","v":0},0,null,null,null,null,0,0,0,{"$f":"T156*'CTI Input Sheet'!K24","v":0},{"$f":"SUM(T156*H11)/60","v":0},null,0,0,0,0,0,0,null,{"$f":"SUM(AB156*AH8)+(AC156*AH9)","v":0},0,0,null,{"$f":"Z156*AO6/60","v":0},{"$f":"AB156*AO8/60","v":0},0,0,{"$f":"AN156*AL6","v":0},null,{"$f":"IF(ProjectData!H$17=\"Not Required\",0,B156*2)","v":0},0,0,{"$f":"AQ156*5.39","v":0},{"$f":"+AR156*AW11","v":0},{"$f":"AR156*AT11","v":0},{"$f":"AR156*AU11/60","v":0}]
[null,{"$f":"ProjectData!J55","v":0},null,36,12,2,3.5,5.5,0,{"$f":"I157*G11","v":0},{"$f":"I157*G13","v":0},{"$f":"J157*'CTI Input Sheet'!B28","v":0},{"$f":"J157*'CTI Input Sheet'!C28","v":0},{"$f":"J157*'CTI Input Sheet'!D28","v":0},0,null,null,null,null,0,0,0,{"$f":"T157*'CTI Input Sheet'!K24","v":0},{"$f":"SUM(T157*H11)/60","v":0},null,0,0,0,0,0,0,null,{"$f":"SUM(AB157*AH8)+(AC157*AH9)","v":0},0,0,null,{"$f":"Z157*AO6/60","v":0},{"$f":"AB157*AO8/60","v":0},0,0,{"$f":"AN157*AL6","v":0},null,{"$f":"IF(ProjectData!H$17=\"Not Required\",0,B157*2)","v":0},0,0,{"$f":"AQ157*2.85","v":0},{"$f":"+AR157*AW12","v":0},{"$f":"AR157*AT12","v":0},{"$f":"AR157*AU12/60","v":0}]
[null,{"$f":"ProjectData!J56","v":0},null,36,24,2,3.5,7.5,0,{"$f":"I158*G11","v":0},{"$f":"I158*G13","v":0},{"$f":"J158*'CTI Input Sheet'!B28","v":0},{"$f":"J158*'CTI Input Sheet'!C28","v":0},{"$f":"J158*'CTI Input Sheet'!D28","v":0},0,null,null,null,null,0,0,0,{"$f":"T158*'CTI Input Sheet'!K24","v":0},{"$f":"SUM(T158*H11)/60","v":0},null,0,0,0,0,0,0,null,{"$f":"SUM(AB158*AH8)+(AC158*AH9)","v":0},0,0,null,{"$f":"Z158*AO6/60","v":0},{"$f":"AB158*AO8/60","v":0},0,0,{"$f":"AN158*AL6","v":0},null,{"$f":"IF(ProjectData!H$17=\"Not Required\",0,B158*2)","v":0},0,0,{"$f":"AQ158*4.62","v":0},{"$f":"+AR158*AW12","v":0},{"$f":"AR158*AT12","v":0},{"$f":"AR158*AU12/60","v":0}]
[null,{"$f":"ProjectData!J57","v":2},null,36,36,2,3.5,9.3000000000000007,25.6,{"$f":"I159*G11","v":97.28},{"$f":"I159*G13","v":583.68000000000006},{"$f":"J159*'CTI Input Sheet'!B28","v":145.92000000000002},{"$f":"J159*'CTI Input Sheet'!C28","v":24.32},{"$f":"J159*'CTI Input Sheet'!D28","v":0},{"$f":"SUM(L159:N159)","v":170.24},null,null,null,null,{"$f":"B159*F159","v":4},97.28,170.24,{"$f":"T159*'CTI Input Sheet'!K24","v":6},{"$f":"SUM(T159*H11)/60","v":1},null,4,64,4,16,0,0,null,{"$f":"SUM(AB159*AH8)+(AC159*AH9)","v":40},0,40,null,{"$f":"Z159*AO6/60","v":0.33333333333333331},{"$f":"AB159*AO8/60","v":0.13333333333333333},0,0.46666666666666667,{"$f":"AN159*AL6","v":35},null,{"$f":"IF(ProjectData!H$17=\"Not Required\",0,B159*2)","v":0},0,0,{"$f":"AQ159*6.38","v":0},{"$f":"+AR159*AW12","v":0},{"$f":"AR159*AT12","v":0},{"$f":"AR159*AU12/60","v":0}]
[null,{"$f":"SUM(B139:B159)","v":6},null,null,null,null,null,null,{"$f":"SUM(I139:I159)","v":45.6},173.28,1039.68,259.92,43.32,0,303.24,null,null,null,null,{"$f":"SUM(T139:T159)","v":12},{"$f":"SUM(U139:U159)","v":173.28},{"$f":"SUM(V139:V159)","v":303.24},{"$f":"SUM(W139:W159)","v":18},{"$f":"SUM(X139:X159)","v":3},null,{"$f":"SUM(Z139:Z159)","v":12},192,12,48,0,0,null,{"$f":"SUM(AG139:AG159)","v":120},{"$f":"SUM(AH139:AH159)","v":0},{"$f":"SUM(AI139:AI159)","v":120},null,{"$f":"SUM(AK139:AK159)","v":1},{"$f":"SUM(AL139:AL159)","v":0.4},{"$f":"SUM(AM139:AM159)","v":0},{"$f":"SUM(AN139:AN159)","v":1.4},{"$f":"SUM(AO139:AO159)","v":105},null,{"$f":"SUM(AQ139:AQ159)","v":0},0,0,0,0,0,0]
[null,null,null,null,null,null,null,null,null,null,null,null,null,null,null,null,null,null,null,null,null,null,{"$f":"W160*'CTI Input Sheet'!H7","v":1350},{"$f":"X160*'CTI Input Sheet'!H6","v":225},null,null,{"$f":"AA160*AH12","v":144},{"$f":"AB160*AH8","v":60},{"$f":"AC160*AH9","v":60},{"$f":"AD160*AH10","v":0},{"$f":"AE160*AH11","v":0},null,null,null,null,null,{"$f":"AK160*AL6","v":75},{"$f":"AL160*AL6","v":30},{"$f":"AM160*AL6","v":0}]
[null,"4\" Expansion Joints",null,"Expansion Joints",null,"NEMA VE 2 : Expansion Joint Support Quantity - Support Weight - Support Steel, Fabrication, Logistics, Erection Costs",null,null,null,null,null,null,null,null,null,null,null,null,null,"4\" Expansion Joint : Support Structure Summary",null,null,null,null,null,"4\" Expansion Joint : Tray Accessory Quantities",null,null,null,null,null,null,"4\" Expansion Joint : Tray Accessory Costs ",null,null,null,"4\" Expansion Joint : Tray Accessory Installation Time & Installation Cost"]
[null,"Quantities",null,"Width (in)","Hieght (in) ","Support Quantity","OS1 Str. Section Length (FT)","OS2 Str. Section Length (FT)","Total Str. Section Length (FT)","Total Str. Section Weight (lb)","Total Str. Section Cost (USD)","Total Fabrication Cost (USD)","Total Logistic Cost (USD)","Total Erection Cost (USD","SUM TOTAL COST/FITTING",null,null,null,null,"Total Quantity of Supports","Total Weight of Supports (LB)","Total Cost of Supports (USD)","Total Design Time (HOURS)","Total Support Instal Time (HOURS)",null,"Splice Plates Quantity (PRS)","Splice Plate Hardware Quantity (PCS)","Hold Down Clamp Quantity (PRS)","Clamp Hardware Quantity (PCS)","Expansion Guides Quantity (PRS)","Guides Hardware Quantity (PCS)",null,"Hold Down Clamps (PR)","Expansion Guides (PR)","Total Accessory Cost",null,"Splice Plates Time/Pair (HRS)","Hold Down Clamp Time/Pair (HRS)","Exp. Guide Time/Pair (HRS)","Total Time (HOURS)","Total Time Cost (USD)"]
[null,{"$f":"P6","v":0},null,6,4,2,1,3,{"$f":"SUM(G164+H164)*B164","v":0},{"$f":"I164*G11","v":0},{"$f":"I164*G13","v":0},{"$f":"J164*'CTI Input Sheet'!B28","v":0},{"$f":"J164*'CTI Input Sheet'!C28","v":0},{"$f":"J164*'CTI Input Sheet'!D28","v":0},{"$f":"SUM(K164:N164)","v":0},null,null,null,null,{"$f":"EVEN(B164*F164)","v":0},{"$f":"J164","v":0},{"$f":"O164","v":0},{"$f":"T164*'CTI Input Sheet'!K25","v":0},{"$f":"SUM(T164*H11)/60","v":0},null,{"$f":"B164*1","v":0},{"$f":"Z164*16","v":0},0,0,{"$f":"EVEN(B164*F164)*1","v":0},{"$f":"AD164*4","v":0},null,{"$f":"SUM(AB164*AH8)+(AC164*AH9)","v":0},{"$f":"SUM(AD164*AH10)+(AD164*AH11)","v":0},{"$f":"SUM(AG164+AH164)+(Z164*AH6)","v":0},null,{"$f":"Z164*AO7/60","v":0},{"$f":"AB164*AO8/60","v":0},{"$f":"AD164*AO9/60","v":0},{"$f":"SUM(AK164:AM164)","v":0},{"$f":"AN164*AL6","v":0}]
[null,0,null,9,4,2,1.25,3.25,0,{"$f":"I165*G11","v":0},{"$f":"I165*G13","v":0},{"$f":"J165*'CTI Input Sheet'!B28","v":0},{"$f":"J165*'CTI Input Sheet'!C28","v":0},{"$f":"J165*'CTI Input Sheet'!D28","v":0},0,null,null,null,null,0,{"$f":"J165","v":0},{"$f":"O165","v":0},{"$f":"T165*'CTI Input Sheet'!K25","v":0},{"$f":"SUM(T165*H11)/60","v":0},null,{"$f":"B165*1","v":0},{"$f":"Z165*16","v":0},0,0,0,0,null,{"$f":"SUM(AB165*AH8)+(AC165*AH9)","v":0},{"$f":"SUM(AD165*AH10)+(AD165*AH11)","v":0},{"$f":"SUM(AG165:AH165)+(Z165*AH6)","v":0},null,{"$f":"Z165*AO7/60","v":0},{"$f":"AB165*AO8/60","v":0},{"$f":"AD165*AO9/60","v":0},0,{"$f":"AN165*AL6","v":0}]
[null,0,null,12,4,2,1.5,3.5,0,{"$f":"I166*G11","v":0},{"$f":"I166*G13","v":0},{"$f":"J166*'CTI Input Sheet'!B28","v":0},{"$f":"J166*'CTI Input Sheet'!C28","v":0},{"$f":"J166*'CTI Input Sheet'!D28","v":0},0,null,null,null,null,0,0,0,{"$f":"T166*'CTI Input Sheet'!K25","v":0},{"$f":"SUM(T166*H11)/60","v":0},null,0,0,0,0,0,0,null,{"$f":"SUM(AB166*AH8)+(AC166*AH9)","v":0},{"$f":"SUM(AD166*AH10)+(AD166*AH11)","v":0},{"$f":"SUM(AG166:AH166)+(Z166*AH6)","v":0},null,{"$f":"Z166*AO7/60","v":0},{"$f":"AB166*AO8/60","v":0},{"$f":"AD166*AO9/60","v":0},0,{"$f":"AN166*AL6","v":0}]
[null,0,null,18,4,2,2,4,0,{"$f":"I167*G11","v":0},{"$f":"I167*G13","v":0},{"$f":"J167*'CTI Input Sheet'!B28","v":0},{"$f":"J167*'CTI Input Sheet'!C28","v":0},{"$f":"J167*'CTI Input Sheet'!D28","v":0},0,null,null,null,null,0,0,0,{"$f":"T167*'CTI Input Sheet'!K25","v":0},{"$f":"SUM(T167*H11)/60","v":0},null,0,0,0,0,0,0,null,{"$f":"SUM(AB167*AH8)+(AC167*AH9)","v":0},{"$f":"SUM(AD167*AH10)+(AD167*AH11)","v":0},{"$f":"SUM(AG167:AH167)+(Z167*AH6)","v":0},null,{"$f":"Z167*AO7/60","v":0},{"$f":"AB167*AO8/60","v":0},{"$f":"AD167*AO9/60","v":0},0,{"$f":"AN167*AL6","v":0}]
[null,0,null,24,4,2,2.5,4.5,0,{"$f":"I168*G11","v":0},{"$f":"I168*G13","v":0},{"$f":"J168*'CTI Input Sheet'!B28","v":0},{"$f":"J168*'CTI Input Sheet'!C28","v":0},{"$f":"J168*'CTI Input Sheet'!D28","v":0},0,null,null,null,null,0,0,0,{"$f":"T168*'CTI Input Sheet'!K25","v":0},{"$f":"SUM(T168*H11)/60","v":0},null,0,0,0,0,0,0,null,{"$f":"SUM(AB168*AH8)+(AC168*AH9)","v":0},{"$f":"SUM(AD168*AH10)+(AD168*AH11)","v":0},{"$f":"SUM(AG168:AH168)+(Z168*AH6)","v":0},null,{"$f":"Z168*AO7/60","v":0},{"$f":"AB168*AO8/60","v":0},{"$f":"AD168*AO9/60","v":0},0,{"$f":"AN168*AL6","v":0}]
[null,0,null,30,4,2,3,5,0,{"$f":"I169*G11","v":0},{"$f":"I169*G13","v":0},{"$f":"J169*'CTI Input Sheet'!B28","v":0},{"$f":"J169*'CTI Input Sheet'!C28","v":0},{"$f":"J169*'CTI Input Sheet'!D28","v":0},0,null,null,null,null,0,0,0,{"$f":"T169*'CTI Input Sheet'!K25","v":0},{"$f":"SUM(T169*H11)/60","v":0},null,0,0,0,0,0,0,null,{"$f":"SUM(AB169*AH8)+(AC169*AH9)","v":0},{"$f":"SUM(AD169*AH10)+(AD169*AH11)","v":0},{"$f":"SUM(AG169:AH169)+(Z169*AH6)","v":0},null,{"$f":"Z169*AO7/60","v":0},{"$f":"AB169*AO8/60","v":0},{"$f":"AD169*AO9/60","v":0},0,{"$f":"AN169*AL6","v":0}]
[null,0,null,36,4,2,3.5,5.5,0,{"$f":"I170*G11","v":0},{"$f":"I170*G13","v":0},{"$f":"J170*'CTI Input Sheet'!B28","v":0},{"$f":"J170*'CTI Input Sheet'!C28","v":0},{"$f":"J170*'CTI Input Sheet'!D28","v":0},0,null,null,null,null,0,0,0,{"$f":"T170*'CTI Input Sheet'!K25","v":0},{"$f":"SUM(T170*H11)/60","v":0},null,0,0,0,0,0,0,null,{"$f":"SUM(AB170*AH8)+(AC170*AH9)","v":0},{"$f":"SUM(AD170*AH10)+(AD170*AH11)","v":0},{"$f":"SUM(AG170:AH170)+(Z170*AH6)","v":0},null,{"$f":"Z170*AO7/60","v":0},{"$f":"AB170*AO8/60","v":0},{"$f":"AD170*AO9/60","v":0},0,{"$f":"AN170*AL6","v":0}]
[null,{"$f":"SUM(B164:B170)","v":0},null,null,null,null,null,null,{"$f":"SUM(I164:I170)","v":0},{"$f":"SUM(J164:J170)","v":0},0,0,0,0,0,null,null,null,null,{"$f":"SUM(T164:T170)","v":0},{"$f":"SUM(U164:U170)","v":0},{"$f":"SUM(V164:V170)","v":0},{"$f":"SUM(W164:W170)","v":0},{"$f":"SUM(X164:X170)","v":0},null,{"$f":"SUM(Z164:Z170)","v":0},0,0,0,0,0,null,{"$f":"SUM(AG164:AG170)","v":0},{"$f":"SUM(AH164:AH170)","v":0},{"$f":"SUM(AI164:AI170)","v":0},null,{"$f":"SUM(AK164:AK170)","v":0},{"$f":"SUM(AL164:AL170)","v":0},{"$f":"SUM(AM164:AM170)","v":0},{"$f":"SUM(AN164:AN170)","v":0},{"$f":"SUM(AO164:AO170)","v":0}]
[null,null,null,null,null,null,null,null,null,null,null,null,null,null,null,null,null,null,null,null,null,null,{"$f":"W171*'CTI Input Sheet'!H7","v":0},{"$f":"X171*'CTI Input Sheet'!H6","v":0},null,null,{"$f":"AA171*AH12","v":0},{"$f":"AB171*AH8","v":0},{"$f":"AC171*AH9","v":0},{"$f":"AD171*AH10","v":0},{"$f":"AE171*AH11","v":0},null,null,null,null,null,{"$f":"AK171*AL6","v":0},{"$f":"AL171*AL6","v":0},{"$f":"AM171*AL6","v":0}]
[null,"6\" Expansion Joints",null,"Expansion Joints",null,"NEMA VE 2 : Expansion Joint Support Quantity - Support Weight - Support Steel, Fabrication, Logistics, Erection Costs",null,null,null,null,null,null,null,null,null,null,null,null,null,"6\" Expansion Joint : Support Structure Summary",null,null,null,null,null,"6\" Expansion Joint : Tray Accessory Quantities",null,null,null,null,null,null,"6\" Expansion Joint : Tray Accessory Costs ",null,null,null,"6\" Expansion Joint : Tray Accessory Installation Time & Installation Cost"]
[null,"Quantities",null,"Width (in)","Hieght (in) ","Support Quantity","OS1 Str. Section Length (FT)","OS2 Str. Section Length (FT)","Total Str. Section Length (FT)","Total Str. Section Weight (lb)","Total Str. Section Cost (USD)","Total Fabrication Cost (USD)","Total Logistic Cost (USD)","Total Erection Cost (USD","SUM TOTAL COST/FITTING",null,null,null,null,"Total Quantity of Supports","Total Weight of Supports (LB)","Total Cost of Supports (USD)","Total Design Time (HOURS)","Total Support Instal Time (HOURS)",null,"Splice Plates Quantity (PRS)","Splice Plate Hardware Quantity (PCS)","Hold Down Clamp Quantity (PRS)","Clamp Hardware Quantity (PCS)","Expansion Guides Quantity (PRS)","Guides Hardware Quantity (PCS)",null,"Hold Down Clamps (PR)","Expansion Guides (PR)","Total Accessory Cost",null,"Splice Plates Time/Pair (HRS)","Hold Down Clamp Time/Pair (HRS)","Exp. Guide Time/Pair (HRS)","Total Time (HOURS)","Total Time Cost (USD)"]
[null,{"$f":"R6","v":0},null,6,6,2,1,3,{"$f":"SUM(G175+H175)*B175","v":0},{"$f":"I175*G11","v":0},{"$f":"I175*G13","v":0},{"$f":"J175*'CTI Input Sheet'!B28","v":0},{"$f":"J175*'CTI Input Sheet'!C28","v":0},{"$f":"J175*'CTI Input Sheet'!D28","v":0},{"$f":"SUM(K175:N175)","v":0},null,null,null,null,{"$f":"EVEN(B175*F175)","v":0},{"$f":"J175","v":0},{"$f":"O175","v":0},{"$f":"T175*'CTI Input Sheet'!K25","v":0},{"$f":"SUM(T175*H11)/60","v":0},null,{"$f":"B175*1","v":0},{"$f":"Z175*16","v":0},0,0,{"$f":"EVEN(B175*F175)*1","v":0},{"$f":"AD175*4","v":0},null,{"$f":"SUM(AB175*AH8)+(AC175*AH9)","v":0},{"$f":"SUM(AD175*AH10)+(AD175*AH11)","v":0},{"$f":"SUM(AG175+AH175)+(Z175*AH7)","v":0},null,{"$f":"Z175*AO7/60","v":0},{"$f":"AB175*AO8/60","v":0},{"$f":"AD175*AO9/60","v":0},{"$f":"SUM(AK175:AM175)","v":0},{"$f":"AN175*AL6","v":0}]
[null,0,null,9,6,2,1.25,3.25,{"$f":"SUM(G176+H176)*B176","v":0},{"$f":"I176*G11","v":0},{"$f":"I176*G13","v":0},{"$f":"J176*'CTI Input Sheet'!B28","v":0},{"$f":"J176*'CTI Input Sheet'!C28","v":0},{"$f":"J176*'CTI Input Sheet'!D28","v":0},0,null,null,null,null,0,0,0,{"$f":"T176*'CTI Input Sheet'!K25","v":0},{"$f":"SUM(T176*H11)/60","v":0},null,0,0,0,0,0,0,null,{"$f":"SUM(AB176*AH8)+(AC176*AH9)","v":0},{"$f":"SUM(AD176*AH10)+(AD176*AH11)","v":0},{"$f":"SUM(AG176:AH176)+(Z176*AH7)","v":0},null,{"$f":"Z176*AO7/60","v":0},{"$f":"AB176*AO8/60","v":0},{"$f":"AD176*AO9/60","v":0},0,{"$f":"AN176*AL6","v":0}]
[null,10,null,12,6,2,1.5,3.5,50,{"$f":"I177*G11","v":190},{"$f":"I177*G13","v":1140},{"$f":"J177*'CTI Input Sheet'!B28","v":285},{"$f":"J177*'CTI Input Sheet'!C28","v":47.5},{"$f":"J177*'CTI Input Sheet'!D28","v":0},1472.5,null,null,null,null,20,190,1472.5,{"$f":"T177*'CTI Input Sheet'!K25","v":10},{"$f":"SUM(T177*H11)/60","v":5},null,10,160,0,0,20,80,null,{"$f":"SUM(AB177*AH8)+(AC177*AH9)","v":0},{"$f":"SUM(AD177*AH10)+(AD177*AH11)","v":125},{"$f":"SUM(AG177:AH177)+(Z177*AH7)","v":325},null,{"$f":"Z177*AO7/60","v":1},{"$f":"AB177*AO8/60","v":0},{"$f":"AD177*AO9/60","v":0.66666666666666663},1.6666666666666665,{"$f":"AN177*AL6","v":124.99999999999999}]
[null,0,null,18,6,2,2,4,0,{"$f":"I178*G11","v":0},{"$f":"I178*G13","v":0},{"$f":"J178*'CTI Input Sheet'!B28","v":0},{"$f":"J178*'CTI Input Sheet'!C28","v":0},{"$f":"J178*'CTI Input Sheet'!D28","v":0},0,null,null,null,null,0,0,0,{"$f":"T178*'CTI Input Sheet'!K25","v":0},{"$f":"SUM(T178*H11)/60","v":0},null,0,0,0,0,0,0,null,{"$f":"SUM(AB178*AH8)+(AC178*AH9)","v":0},{"$f":"SUM(AD178*AH10)+(AD178*AH11)","v":0},{"$f":"SUM(AG178:AH178)+(Z178*AH7)","v":0},null,{"$f":"Z178*AO7/60","v":0},{"$f":"AB178*AO8/60","v":0},{"$f":"AD178*AO9/60","v":0},0,{"$f":"AN178*AL6","v":0}]
[null,0,null,24,6,2,2.5,4.5,0,{"$f":"I179*G11","v":0},{"$f":"I179*G13","v":0},{"$f":"J179*'CTI Input Sheet'!B28","v":0},{"$f":"J179*'CTI Input Sheet'!C28","v":0},{"$f":"J179*'CTI Input Sheet'!D28","v":0},0,null,null,null,null,0,0,0,{"$f":"T179*'CTI Input Sheet'!K25","v":0},{"$f":"SUM(T179*H11)/60","v":0},null,0,0,0,0,0,0,null,{"$f":"SUM(AB179*AH8)+(AC179*AH9)","v":0},{"$f":"SUM(AD179*AH10)+(AD179*AH11)","v":0},{"$f":"SUM(AG179:AH179)+(Z179*AH7)","v":0},null,{"$f":"Z179*AO7/60","v":0},{"$f":"AB179*AO8/60","v":0},{"$f":"AD179*AO9/60","v":0},0,{"$f":"AN179*AL6","v":0}]
[null,0,null,30,6,2,3,5,0,{"$f":"I180*G11","v":0},{"$f":"I180*G13","v":0},{"$f":"J180*'CTI Input Sheet'!B28","v":0},{"$f":"J180*'CTI Input Sheet'!C28","v":0},{"$f":"J180*'CTI Input Sheet'!D28","v":0},0,null,null,null,null,0,0,0,{"$f":"T180*'CTI Input Sheet'!K25","v":0},{"$f":"SUM(T180*H11)/60","v":0},null,0,0,0,0,{"$f":"EVEN(B180*F180)*1","v":0},0,null,{"$f":"SUM(AB180*AH8)+(AC180*AH9)","v":0},{"$f":"SUM(AD180*A10)+(AD180*AH11)","v":0},{"$f":"SUM(AG180:AH180)+(Z180*AH7)","v":0},null,{"$f":"Z180*AO7/60","v":0},{"$f":"AB180*AO8/60","v":0},{"$f":"AD180*AO9/60","v":0},0,{"$f":"AN180*AL6","v":0}]
[null,5,null,36,6,2,3.5,5.5,45,{"$f":"I181*G11","v":171},{"$f":"I181*G13","v":1026},{"$f":"J181*'CTI Input Sheet'!B28","v":256.5},{"$f":"J181*'CTI Input Sheet'!C28","v":42.75},{"$f":"J181*'CTI Input Sheet'!D28","v":0},{"$f":"SUM(K181:N181)","v":1325.25},null,null,null,null,10,171,1325.25,{"$f":"T181*'CTI Input Sheet'!K25","v":5},{"$f":"SUM(T181*H11)/60","v":2.5},null,5,80,0,0,10,40,null,{"$f":"SUM(AB181*AH8)+(AC181*AH9)","v":0},{"$f":"SUM(AD181*AH10)+(AD181*AH11)","v":62.5},{"$f":"SUM(AG181:AH181)+(Z181*AH7)","v":162.5},null,{"$f":"Z181*AO7/60","v":0.5},{"$f":"AB181*AO8/60","v":0},{"$f":"AD181*AO9/60","v":0.33333333333333331},0.83333333333333326,{"$f":"AN181*AL6","v":62.499999999999993}]
[null,{"$f":"SUM(B175:B181)","v":15},null,null,null,null,null,null,{"$f":"SUM(I175:I181)","v":95},361,2166,541.5,90.25,0,{"$f":"SUM(O175:O181)","v":2797.75},null,null,null,null,{"$f":"SUM(T175:T181)","v":30},{"$f":"SUM(U175:U181)","v":361},{"$f":"SUM(V175:V181)","v":2797.75},{"$f":"SUM(W175:W181)","v":15},{"$f":"SUM(X175:X181)","v":7.5},null,{"$f":"SUM(Z175:Z181)","v":15},240,0,0,30,120,null,{"$f":"SUM(AG175:AG181)","v":0},{"$f":"SUM(AH175:AH181)","v":187.5},{"$f":"SUM(AI175:AI181)","v":487.5},null,{"$f":"SUM(AK175:AK181)","v":1.5},{"$f":"SUM(AL175:AL181)","v":0},{"$f":"SUM(AM175:AM181)","v":1},{"$f":"SUM(AN175:AN181)","v":2.5},{"$f":"SUM(AO175:AO181)","v":187.49999999999997}]
[null,null,null,null,null,null,null,null,null,null,null,null,null,null,null,null,null,null,null,null,null,null,{"$f":"W182*'CTI Input Sheet'!H7","v":1125},{"$f":"X182*'CTI Input Sheet'!H6","v":562.5},null,null,{"$f":"AA182*AH12","v":180},{"$f":"AB182*AH8","v":0},{"$f":"AC182*AH9","v":0},{"$f":"AD182*AH10","v":150},{"$f":"AE182*AH11","v":150},null,null,null,null,null,{"$f":"AK182*AL6","v":112.5},{"$f":"AL182*AL6","v":0},{"$f":"AM182*AL6","v":75}]
[null,"HADJ Splice Plates",null,"HADJ Splice Plates",null,"NEMA VE 2 : HADJ Support Quantity - Support Weight - Support Steel, Fabrication, Logistics, Erection Costs",null,null,null,null,null,null,null,null,null,null,null,null,null,"HADJ : Support Structure Summary",null,null,null,null,null,"HADJ : Tray Accessory Quantities",null,null,null,null,null,null,"HADJ : Tray Accessory Costs ",null,null,null,"HADJ : Tray Accessory Installation Time & Installation Cost"]
[null,"Quantities",null,"Hieght (in) ",null,"Support Quantity","OS1 Str. Section Length (FT)","OS2 Str. Section Length (FT)","OS3 Str. Section Length (FT)","Total Str. Section Length (FT)","Total Str. Section Weight (lb)","Total Str. Section Cost (USD)","Total Fabrication Cost (USD)","Total Logistic Cost (USD)","Total Erection Cost (USD","SUM TOTAL COST/FITTING",null,null,null,"Total Quantity of Supports","Total Weight of Supports (LB)","Total Cost of Supports (USD)","Total Design Time (HOURS)","Total Support Instal Time (HOURS)",null,"HADJ Splice Quantity (PRS)","Splice Plate Hardware Quantity (PCS)","Hold Down Clamp Quantity (PRS)","Clamp Hardware Quantity (PCS)","Expansion Guides Quantity (PRS)","Guides Hardware Quantity (PCS)",null,"Hold Down Clamps (PR)","Expansion Guides (PR)","Total Accessory Cost",null,"Splice Plates Time/Pair (HRS)","Hold Down Clamp Time/Pair (HRS)","Exp. Guide Time/Pair (HRS)","Total Time (HOURS)","Total Time Cost (USD)"]
[null,{"$f":"SUM(ProjectData!G88:G89)","v":0},null,0,null,3,2.5,2.5,4.5,{"$f":"SUM(G186+H186+I186)*B186","v":0},{"$f":"J186*G11","v":0},{"$f":"J186*G13","v":0},{"$f":"K186*'CTI Input Sheet'!B28","v":0},{"$f":"K186*'CTI Input Sheet'!C28","v":0},{"$f":"K186*'CTI Input Sheet'!D28","v":0},{"$f":"SUM(L186:O186)","v":0},null,null,null,{"$f":"SUM(B186*F186)","v":0},{"$f":"K186","v":0},{"$f":"P186","v":0},{"$f":"T186*'CTI Input Sheet'!K27","v":0},{"$f":"SUM(T186*H11)/60","v":0},null,{"$f":"B186*1","v":0},{"$f":"Z186*16","v":0},{"$f":"SUM(B186*F186)*1","v":0},{"$f":"AB186*4","v":0},0,0,null,{"$f":"SUM(AB186*AH8)+(AC186*AH9)","v":0},0,{"$f":"SUM(AG186:AH186)","v":0},null,{"$f":"Z186*AO6/60","v":0},{"$f":"AB186*AO8/60","v":0},0,{"$f":"SUM(AK186:AM186)","v":0},{"$f":"AN186*AL6","v":0}]
[null,{"$f":"SUM(B186:B186)","v":0},null,null,null,null,null,null,null,{"$f":"J186","v":0},{"$f":"K186","v":0},0,0,0,0,0,null,null,null,{"$f":"T186","v":0},{"$f":"U186","v":0},{"$f":"V186","v":0},{"$f":"W186","v":0},{"$f":"X186","v":0},null,{"$f":"Z186","v":0},0,0,0,0,0,null,{"$f":"AG186","v":0},{"$f":"AH186","v":0},{"$f":"AI186","v":0},null,{"$f":"SUM(AK186:AK186)","v":0},{"$f":"SUM(AL186:AL186)","v":0},{"$f":"SUM(AM186:AM186)","v":0},{"$f":"SUM(AN186:AN186)","v":0},{"$f":"SUM(AO186:AO186)","v":0}]
[null,null,null,null,null,null,null,null,null,null,null,null,null,null,null,null,null,null,null,null,null,null,{"$f":"W187*'CTI Input Sheet'!H7","v":0},{"$f":"X187*'CTI Input Sheet'!H6","v":0},null,null,{"$f":"AA187*AH12","v":0},{"$f":"AB187*AH8","v":0},{"$f":"AC187*AH9","v":0},{"$f":"AD187*AH10","v":0},{"$f":"AE187*AH11","v":0},null,null,null,null,null,{"$f":"AK187*AL6","v":0},{"$f":"AL187*AL6","v":0},{"$f":"AM187*AL6","v":0}]
[null,"VADJ Splice Plates",null,"VADJ Splice Plates",null,"NEMA VE 2 : VADJ Support Quantity - Support Weight - Support Steel, Fabrication, Logistics, Erection Costs",null,null,null,null,null,null,null,null,null,null,null,null,null,"VADJ : Support Structure Summary",null,null,null,null,null,"VADJ : Tray Accessory Quantities",null,null,null,null,null,null,"VADJ : Tray Accessory Costs ",null,null,null,"VADJ : Tray Accessory Installation Time & Installation Cost"]
[null,"Quantities",null,"Hieght (in) ",null,"Support Quantity","OS1 Str. Section Length (FT)","OS2 Str. Section Length (FT)","OS3 Str. Section Length (FT)","Total Str. Section Length (FT)","Total Str. Section Weight (lb)","Total Str. Section Cost (USD)","Total Fabrication Cost (USD)","Total Logistic Cost (USD)","Total Erection Cost (USD","SUM TOTAL COST/FITTING",null,null,null,"Total Quantity of Supports","Total Weight of Supports (LB)","Total Cost of Supports (USD)","Total Design Time (HOURS)","Total Support Instal Time (HOURS)",null,"VADJ Splice Quantity (PRS)","Splice Plate Hardware Quantity (PCS)","Hold Down Clamp Quantity (PRS)","Clamp Hardware Quantity (PCS)","Expansion Guides Quantity (PRS)","Guides Hardware Quantity (PCS)",null,"Hold Down Clamps (PR)","Expansion Guides (PR)","Total Accessory Cost",null,"Splice Plates Time/Pair (HRS)","Hold Down Clamp Time/Pair (HRS)","Exp. Guide Time/Pair (HRS)","Total Time (HOURS)","Total Time Cost (USD)"]
[null,{"$f":"SUM(ProjectData!D88:D89)","v":0},null,0,null,2,2.5,2.5,0,{"$f":"SUM(G191+H191)*B191","v":0},{"$f":"J191*G11","v":0},{"$f":"J191*G13","v":0},{"$f":"K191*'CTI Input Sheet'!B28","v":0},{"$f":"K191*'CTI Input Sheet'!C28","v":0},{"$f":"K191*'CTI Input Sheet'!D28","v":0},{"$f":"SUM(L191:O191)","v":0},null,null,null,{"$f":"SUM(B191*F191)","v":0},{"$f":"K191","v":0},{"$f":"P191","v":0},{"$f":"T191*'CTI Input Sheet'!K28","v":0},{"$f":"SUM(T191*H11)/60","v":0},null,{"$f":"B191*1","v":0},{"$f":"Z191*16","v":0},{"$f":"SUM(B191*F191)*1","v":0},{"$f":"AB191*4","v":0},0,0,null,{"$f":"SUM(AB191*AH8)+(AC191*AH9)","v":0},0,{"$f":"SUM(AG191:AH191)","v":0},null,{"$f":"Z191*AO6/60","v":0},{"$f":"AB191*AO8/60","v":0},0,{"$f":"SUM(AK191:AM191)","v":0},{"$f":"AN191*AL6","v":0}]
[null,{"$f":"SUM(B191:B191)","v":0},null,null,null,null,null,null,null,{"$f":"J191","v":0},{"$f":"K191","v":0},0,0,0,0,0,null,null,null,{"$f":"T191","v":0},{"$f":"U191","v":0},{"$f":"V191","v":0},{"$f":"W191","v":0},{"$f":"X191","v":0},null,{"$f":"Z191","v":0},0,0,0,0,0,null,{"$f":"AG191","v":0},{"$f":"AH191","v":0},{"$f":"AI191","v":0},null,{"$f":"SUM(AK191:AK191)","v":0},{"$f":"SUM(AL191:AL191)","v":0},{"$f":"SUM(AM191:AM191)","v":0},{"$f":"SUM(AN191:AN191)","v":0},{"$f":"SUM(AO191:AO191)","v":0}]
[null,null,null,null,null,"NEMA VE 2 : Reducer Support Quantity - Support Weight - Support Steel, Fabrication, Logistics, Erection Costs",null,null,null,null,null,null,null,null,null,null,null,null,null,null,null,null,{"$f":"W192*'CTI Input Sheet'!H7","v":0},{"$f":"X192*'CTI Input Sheet'!H6","v":0},null,null,{"$f":"AA192*AH12","v":0},{"$f":"AB192*AH8","v":0},{"$f":"AC192*AH9","v":0},{"$f":"AD192*AH10","v":0},{"$f":"AE192*AH11","v":0},null,null,null,null,null,{"$f":"AK192*AL6","v":0},{"$f":"AL192*AL6","v":0},{"$f":"AM192*AL6","v":0}]
[null,"Reducers",null,"VADJ Splice Plates",null,null,null,null,null,null,null,null,null,null,null,null,null,null,null,"REDUCER : Support Structure Summary",null,null,null,null,null,"REDUCER : Tray Accessory Quantities",null,null,null,null,null,null,"REDUCER : Tray Accessory Costs ",null,null,null,"Reducer : Tray Accessory Installation Time & Installation Cost",null,null,null,null,null,"Reducer Covers"]
[null,"Quantities",null,"VADJ Splice Plates",null,"Support Quantity","OS1 Str. Section Length (FT)","OS2 Str. Section Length (FT)","OS3 Str. Section Length (FT)","Total Str. Section Length (FT)","Total Str. Section Weight (lb)","Total Str. Section Cost (USD)","Total Fabrication Cost (USD)","Total Logistic Cost (USD)","Total Erection Cost (USD","SUM TOTAL COST/FITTING",null,null,null,"Total Quantity of Supports","Total Weight of Supports (LB)","Total Cost of Supports (USD)","Total Design Time (HOURS)","Total Support Instal Time (HOURS)",null,"Splice Plate Quantity (PRS)","Splice Plate Hardware Quantity (PCS)","Hold Down Clamp Quantity (PRS)","Clamp Hardware Quantity (PCS)","Expansion Guides Quantity (PRS)","Guides Hardware Quantity (PCS)",null,"Hold Down Clamps (PR)","Expansion Guides (PR)","Total Accessory Cost",null,"Splice Plates Time/Pair (HRS)","Hold Down Clamp Time/Pair (HRS)","Exp. Guide Time/Pair (HRS)","Total Time (HOURS)","Total Time Cost (USD)",null,"Cover Quantity (PC)","Clamp Quantity (PC)","Hardware Quantity (PC)","Cover Weight (lbs)","Clamp Weight (lbs)","Clamps Cost (USD)","Installation Time (min)"]
[null,{"$f":"SUM(ProjectData!J88:J89)","v":0},null,"VADJ Splice Plates",null,2,1.5,2.5,0,{"$f":"SUM(G196+H196)*B196","v":0},{"$f":"J196*G11","v":0},{"$f":"J196*G13","v":0},{"$f":"K196*'CTI Input Sheet'!B28","v":0},{"$f":"K196*'CTI Input Sheet'!C28","v":0},{"$f":"K196*'CTI Input Sheet'!D28","v":0},{"$f":"SUM(L196:O196)","v":0},null,null,null,{"$f":"SUM(B196*F196)","v":0},{"$f":"K196","v":0},{"$f":"P196","v":0},{"$f":"T196*'CTI Input Sheet'!K26","v":0},{"$f":"SUM(T196*H11)/60","v":0},null,{"$f":"B196*2","v":0},{"$f":"Z196*16","v":0},{"$f":"SUM(B196*F196)*1","v":0},{"$f":"AB196*4","v":0},0,0,null,{"$f":"SUM(AB196*AH8)+(AC196*AH9)","v":0},0,{"$f":"SUM(AG196:AH196)","v":0},null,{"$f":"Z196*AO6/60","v":0},{"$f":"AB196*AO8/60","v":0},0,{"$f":"SUM(AK196:AM196)","v":0},{"$f":"AN196*AL6","v":0},null,{"$f":"B196","v":0},{"$f":"AQ196*2","v":0},{"$f":"AR196*4","v":0},{"$f":"AQ196*0.75","v":0},{"$f":"AR196*AW9","v":0},{"$f":"AR196*AT10","v":0},{"$f":"AR196*AU10","v":0}]
[null,{"$f":"SUM(B196:B196)","v":0},null,"VADJ Splice Plates",null,null,null,null,null,{"$f":"SUM(J196:J196)","v":0},0,0,0,0,0,{"$f":"SUM(P196:P196)","v":0},null,null,null,{"$f":"SUM(T196:T196)","v":0},{"$f":"SUM(U196:U196)","v":0},{"$f":"SUM(V196:V196)","v":0},{"$f":"SUM(W196:W196)","v":0},{"$f":"SUM(X196:X196)","v":0},null,{"$f":"SUM(Z196:Z196)","v":0},0,0,0,0,0,null,{"$f":"SUM(AG196:AG196)","v":0},{"$f":"SUM(AH196:AH196)","v":0},{"$f":"SUM(AI196:AI196)","v":0},null,{"$f":"SUM(AK196:AK196)","v":0},{"$f":"SUM(AL196:AL196)","v":0},{"$f":"SUM(AM196:AM196)","v":0},{"$f":"SUM(AN196:AN196)","v":0},{"$f":"SUM(AO196:AO196)","v":0},null,{"$f":"AQ196","v":0},0,0,0,0,0,0]
[null,null,null,null,null,null,null,null,null,null,null,null,null,null,null,{"$f":"P196","v":0},null,null,null,null,null,null,{"$f":"W197*'CTI Input Sheet'!H7","v":0},{"$f":"X197*'CTI Input Sheet'!H6","v":0},null,null,{"$f":"AA197*AH12","v":0},{"$f":"AB197*AH8","v":0},{"$f":"AC197*AH9","v":0},{"$f":"AD197*AH10","v":0},{"$f":"AE197*AH11","v":0},null,null,null,null,null,{"$f":"AK197*AL6","v":0},{"$f":"AL197*AL6","v":0},{"$f":"AM197*AL6","v":0}]
[]
[]
[null,"TOTAL VE-2 COST:",null,{"$f":"SUM(E214+E218+E221+E225+E227+E229+E231+E233+E235+E237+E239)","v":21205.119999999999}]
[]
[null,"TOTAL VE-2 HRS:",null,{"$f":"SUM(E216+E220+E226+E232+E238)","v":142.58316666666667}]
[]
[]
[]
[]
["NEMA VE-2 SHEET SUM TOTALS"]
[]
[null,"SUPPORT QUANTITY (EA):",null,null,{"$f":"SUM(T24+T35+T60+T85+T110+T135+T160+T171+T182+T187+T192+T197)","v":119}]
[]
[null,"SUPPORT STRUCTURE WEIGHT (LBS):",null,null,{"$f":"SUM(U24+U35+U60+U85+U110+U135+U160+U171+U182+U187+U192+U197)","v":1288.58}]
[null,"SUPPORT STRUCTURE LINEAR LENGTH (FT):",null,null,{"$f":"G24+G35+J60+K85+L110+I135+I160+I171+I182+J187+J192+J197","v":339.1}]
[null,"SUPPORT STRUCTURE MATERIAL COST (USD)",null,null,{"$f":"SUM(V24+V35+V60+V85+V110+V135+V160+V171+V182+V187+V192+V197)","v":8080.415}]
[null,"(does not include installation cost)"]
[null,"SUPPORT STRUCTURE DESIGN TIME (HRS):",null,null,{"$f":"SUM(W24+W35+W60+W85+W110+W135+W160+W171+W182+W187+W192+W197)","v":100.25}]
[]
[null,"SUPPORT STRUCTURE DESIGN TIME COST (USD):",null,null,{"$f":"SUM(W25+W36+W61+W86+W111+W136+W161+W172+W183+W188+W193+W198)","v":7518.75}]
[]
[null,"SUPPORT STRUCTURE INSTALLATION TIME (HRS):",null,null,{"$f":"SUM(X24+X35+X60+X85+X110+X135+X160+X171+X182+X187+X192+X197)","v":29.75}]
[null,"SUPPORT STRUCTURE INSTALLATION COST (USD):",null,null,{"$f":"SUM(X25+X36+X61+X86+X111+X136+X161+X172+X183+X188+X193+X198)","v":2231.25}]
[null,"SPLICE PLATES QUANTITY (PRS):",null,null,{"$f":"SUM(Z24+Z35+Z60+Z85+Z110+Z135+Z160+Z171+Z182+Z187+Z192+Z197)","v":98}]
[]
[null,"SPLICE PLATES HARDWARE QUANTITY (PCS):",null,null,{"$f":"E222*16","v":1568}]
[null,"SPLICE PLATES HARDWARE COST (USD)",null,null,{"$f":"SUM(AA25+AA36+AA61+AA86+AA111+AA136+AA161+AA172+AA183+AA188+AA193+AA198)","v":1176}]
[null,"SPLICE PLATES INSTALLATION TIME (HRS)",null,null,{"$f":"SUM(AK24+AK35+AK60+AK85+AK110+AK135+AK160+AK171+AK182+AK187+AK192+AK197)","v":8.4166666666666679}]
[null,"SPLICE PLATES INSTALLATION COST (USD)",null,null,{"$f":"SUM(AK25+AK36+AK61+AK86+AK111+AK136+AK161+AK172+AK183+AK188+AK193+AK198)","v":631.25}]
[null,"CLAMPS QUANTITY (PRS)",null,null,{"$f":"SUM(AB24)+(AB35)+(AB60)+(AB85)+(AB110)+(AB135)+(AB160)+(AB171)+(AB182)+(AB187)+(AB192)+(AB197)","v":59.9985}]
[null,"CLAMPS COST (USD)",null,null,{"$f":"SUM(AB25+AB36+AB61+AB86+AB111+AB136+AB161+AB172+AB183+AB188+AB193+AB198)","v":299.99250000000001}]
[null,"CLAMPS HARDWARE QUANTITY (PCS)",null,null,{"$f":"SUM(AC24)+(AC35)+(AC60)+(AC85)+(AC110)+(AC135)+(AC160)+(AC171)+(AC182)+(AC187)+(AC192)+(AC197)","v":239.994}]
[null,"CLAMPS HARDWARE COST (USD)",null,null,{"$f":"SUM(AC25+AC36+AC61+AC86+AC111+AC136+AC161+AC172+AC183+AC188+AC193+AC198)","v":299.99250000000001}]
[null,"CLAMPS INSTALLATION TIME (HRS)",null,null,{"$f":"SUM(AL24+AL35+AL60+AL85+AL110+AL135+AL160+AL171+AL182+AL187+AL192+AL197)","v":1.9999500000000001}]
[null,"CLAMP INSTALLATION COST (USD)",null,null,{"$f":"SUM(AL25+AL36+AL61+AL86+AL111+AL136+AL161+AL172+AL183+AL188+AL193+AL198)","v":149.99625}]
[null,"GUIDES QUANTITY (PRS)",null,null,{"$f":"SUM(AD24)+(AD35)+(AD60)+(AD85)+(AD110)+(AD135)+(AD160)+(AD171)+(AD182)+(AD187)+(AD192)+(AD197)","v":64.996499999999997}]
[null,"GUIDES COST (USD)",null,null,{"$f":"SUM(AD25+AD36+AD61+AD86+AD111+AD136+AD161+AD172+AD183+AD188+AD193+AD198)","v":324.98249999999996}]
[null,"GUIDES HARDWARE QUANTITY (PCS)",null,null,{"$f":"SUM(AE24)+(AE35)+(AE60)+(AE85)+(AE110)+(AE135)+(AE160)+(AE171)+(AE182)+(AE187)+(AE192)+(AE197)","v":264}]
[null,"GUIDES HARDWARE COST (USD)",null,null,{"$f":"SUM(AE25+AE36+AE61+AE86+AE111+AE136+AE161+AE172+AE183+AE188+AE193+AE198)","v":330}]
[null,"GUIDES INSTALLATION TIME (HRS)",null,null,{"$f":"SUM(AM24+AM35+AM60+AM85+AM110+AM135+AM160+AM171+AM182+AM187+AM192+AM197)","v":2.16655}]
[null,"GUIDES INSTALLATION COST (USD)",null,null,{"$f":"SUM(AM25+AM36+AM61+AM86+AM111+AM136+AM161+AM172+AM183+AM188+AM193+AM198)","v":162.49124999999998}]
[null,"TOTAL TRAY HARDWARE QUANTITY (PCS):",null,null,{"$f":"SUM(E224)+(E230)+(E236)","v":2071.9939999999997}]
[null,"TOTAL TRAY HARDWARE COST (USD):",null,null,{"$f":"SUM(E225+E231+E237)","v":1805.9925000000001}]
[null,"TOTAL TRAY INSTALLATION TIME (HRS):",null,null,{"$f":"SUM(AN24+AN35+AN60+AN85+AN110+AN135+AN160+AN171+AN182+AN187+AN192+AN197)","v":12.583166666666665}]
[]
[null,"TOTAL TRAY INSTALLATION TIME COST (USD):",null,null,{"$f":"E242*AL6","v":943.73749999999984}]
[]
[null,"NUMBER 40ft FLAT BED TRUCKS (EA):",null,null,{"$f":"E212/20000","v":6.4429E-2}]
[]
[null,"COST OF 40ft FLAT BED TRUCKS (USD):",null,null,{"$f":"SUM(E246)*AA7","v":515.43200000000002}]
[]
[null,"NUMBER 30ft HOT SHOT (EA):",null,null,{"$f":"SUM(E212)/12500","v":0.10308639999999999}]
[]
[null,"COST OF 30ft HOT SHOT (USD):",null,null,{"$f":"E250*AA6","v":566.97519999999997}]
[]
[null,"NUMBER 40ft CONTAINERS (EA):",null,null,{"$f":"SUM(E212)/15000","v":8.5905333333333334E-2}]
[]
[null,"COST OF 40ft CONTAINERS (USD):",null,null,{"$f":"E254*AA8","v":859.05333333333328}]
[]
[]
["TRAY ACCESSORY HARDWARE QUANTITY (pcs) BY ITEM",null,null,null,null,null,null,null,null,null,"COVERS QUANTITY SUMMARY (pcs) BY ITEM"]
[null,"ITEM",null,"SPLICE HDWR QTY","CLAMP HDWR QTY","GUIDE HDWR QTY","TOTAL HDWR QTY","TOTAL INSTAL TIME (hrs)","TOTAL TIME COST (usd)",null,"ITEM","COVERS QTY (pcs)","CLAMPS QTY (pcs)","HDWR QTY (pcs)","COVER WEIGHT (lbs)","CLAMP WEIGHT (lbs)","CLAMP COST (usd)","CLAMP INSTAL TIME (hrs)",null,"CLAMP INSTAL COST (usd)"]
[]
[null,"4\" STRAIGHT SECTION",null,{"$f":"AA24","v":0},{"$f":"AC24","v":0},{"$f":"AE24","v":0},{"$f":"SUM(AA24+AC24+AE24)","v":0},{"$f":"AN24","v":0},{"$f":"AO24","v":0},null,"4\" STRAIGHT SECTION",{"$f":"AQ24","v":0},0,0,0,0,0,{"$f":"AW24/60","v":0},null,{"$f":"R262*AL6","v":0}]
[null,"6\" STRAIGHT SECTION",null,{"$f":"AA35","v":720},{"$f":"AC35","v":59.993999999999993},{"$f":"AE35","v":144},{"$f":"SUM(AA35+AC35+AE35)","v":923.99400000000003},{"$f":"AN35","v":5.4164999999999992},{"$f":"AO35","v":406.23749999999995},null,"6\" STRAIGHT SECTION",{"$f":"AQ35","v":0},0,0,0,0,0,{"$f":"AW35/60","v":0},null,{"$f":"R263*AL6","v":0}]
[null,"HB",null,{"$f":"AA60","v":128},{"$f":"AC60","v":48},{"$f":"AE60","v":0},{"$f":"SUM(AA60+AC60+AE60)","v":176},{"$f":"AN60","v":1.0666666666666667},{"$f":"AO60","v":80},null,"HB",{"$f":"AQ60","v":0},0,0,0,0,0,{"$f":"AW60/60","v":0},null,{"$f":"R264*AL6","v":0}]
[null,"HT",null,{"$f":"AA85","v":96},{"$f":"AC85","v":36},{"$f":"AE85","v":0},{"$f":"SUM(AA85+AC85+AE85)","v":132},{"$f":"AN85","v":0.8},{"$f":"AO85","v":60},null,"HT",{"$f":"AQ85","v":0},0,0,0,0,0,{"$f":"AW85/60","v":0},null,{"$f":"R265*AL6","v":0}]
[null,"HX",null,{"$f":"AA110","v":0},{"$f":"AC110","v":0},{"$f":"AE110","v":0},{"$f":"SUM(AA110+AC110+AE110)","v":0},{"$f":"AN110","v":0},{"$f":"AO110","v":0},null,"HX",{"$f":"AQ110","v":0},0,0,0,0,0,{"$f":"AW110/60","v":0},null,{"$f":"R266*AL6","v":0}]
[null,"VI",null,{"$f":"AA135","v":192},{"$f":"AC135","v":48},{"$f":"AE135","v":0},{"$f":"SUM(AA135+AC135+AE135)","v":240},{"$f":"AN135","v":1.4},{"$f":"AO135","v":105},null,"VI",{"$f":"AQ135","v":0},0,0,0,0,0,{"$f":"AW135/60","v":0},null,{"$f":"R267*AL6","v":0}]
[null,"VO",null,{"$f":"AA160","v":192},{"$f":"AC160","v":48},{"$f":"AE160","v":0},{"$f":"SUM(AA160+AC160+AE160)","v":240},{"$f":"AN160","v":1.4},{"$f":"AO160","v":105},null,"VO",{"$f":"AQ160","v":0},0,0,0,0,0,{"$f":"AW160/60","v":0},null,{"$f":"R268*AL6","v":0}]
[null,"4\" EXPANSION KIT",null,{"$f":"AA171","v":0},{"$f":"AC171","v":0},{"$f":"AE171","v":0},{"$f":"SUM(AA171+AC171+AE171)","v":0},{"$f":"AN171","v":0},{"$f":"AO171","v":0}]
[null,"6\" EXPANSION KIT",null,{"$f":"AA182","v":240},{"$f":"AC182","v":0},{"$f":"AE182","v":120},{"$f":"SUM(AA182+AC182+AE182)","v":360},{"$f":"AN182","v":2.5},{"$f":"AO182","v":187.49999999999997}]
[null,"HADJ",null,{"$f":"AA187","v":0},{"$f":"AC187","v":0},{"$f":"AE187","v":0},{"$f":"SUM(AA187+AC187+AE187)","v":0},{"$f":"AN187","v":0},{"$f":"AO187","v":0}]
[null,"VADJ",null,{"$f":"AA192","v":0},{"$f":"AC192","v":0},{"$f":"AE192","v":0},{"$f":"SUM(AA192+AC192+AE192)","v":0},{"$f":"AN192","v":0},{"$f":"AO192","v":0}]
[null,"REDUCER",null,{"$f":"AA197","v":0},{"$f":"AC197","v":0},{"$f":"AE197","v":0},{"$f":"SUM(AA197+AC197+AE197)","v":0},{"$f":"AN197","v":0},{"$f":"AO197","v":0},null,"REDUCER",{"$f":"AQ197","v":0},0,0,0,0,0,{"$f":"AW197/60","v":0},null,{"$f":"R197*AL6","v":0}]
[]
[null,"SUM TOTALS:",null,{"$f":"SUM(D262:D273)","v":1568},239.994,264,2071.9940000000001,12.583166666666665,943.73749999999995,null,"SUM TOTALS:",{"$f":"SUM(L262:L268)","v":0},0,0,0,0,0,{"$f":"SUM(R262:R268)","v":0},null,{"$f":"SUM(T262:T268)","v":0}]
[]
[]
["STRUT TRAPEZE SUPPORT : STRUT & HARDWARE QUANTITY (pcs)",null,null,null,null,null,null,null,null,null,"HADJ QUANTITY SUMMARY"]
[null,"ITEM",null,"TOTAL STRUT QTY (ft)","TOTAL ATR QTY (ft)","TOTAL FITTINGS QTY (pcs)","TOTAL HDWR QTY (pcs)","TOTAL INSTAL TIME (hrs)","TOTAL INSTAL TIME COST (usd)",null,null,"SUPPORT QTY (pcs)","SUPPORT WEIGHT (lbs)","SUPPORT DESIGN TIME (hrs)","SUPPORT INSTAL TIME (hrs)","SUPPORT COST (usd)","CLAMPS QTY (pcs)","TOTAL HDWR QTY (pcs)",null,"CLAMP INSTAL TIME (hrs)","CLAMP INSTAL TIME COST (usd)"]
[]
[null,"4\" ST SC  STRUT",null,{"$f":"G24","v":0},{"$f":"(B17*E17*4)+(B18*E18*4)+(B19*E19*4)+(B20*E20*4)+(B21*E21*4)+(B22*E22*4)+(B23*E23*4)","v":0},{"$f":"(B17*E17*4)+(B18*E18*4)+(B19*E19*4)+(B20*E20*4)+(B21*E21*4)+(B22*E22*4)+(B23*E23*4)","v":0},{"$f":"(B17*E17*4)+(B18*E18*4)+(B19*E19*4)+(B20*E20*4)+(B21*E21*4)+(B22*E22*4)+(B23*E23*4)","v":0},{"$f":"(((B17*E17*AO11)+(B18*E18*AO11)+(B19*E19*AO11)+(B20*E20*AO11)+(B21*E21*AO11)+(B22*E22*AO11)+(B23*E23*AO11))/60)","v":0},{"$f":"H281*AL7","v":0},null,"SUM TOTALS:",{"$f":"T187","v":0},{"$f":"U187","v":0},{"$f":"W187","v":0},{"$f":"X187","v":0},{"$f":"V187","v":0},{"$f":"AB187","v":0},{"$f":"AC187","v":0},null,{"$f":"AN187","v":0},{"$f":"AO187","v":0}]
[null,"6\" ST SC  STRUT",null,{"$f":"G35","v":97.5},{"$f":"(B28*E28*4)+(B29*E29*4)+(B30*E30*4)+(B31*E31*4)+(B32*E32*4)+(B33*E33*4)+(B34*E34*4)","v":180},{"$f":"(B28*E28*4)+(B29*E29*4)+(B30*E30*4)+(B31*E31*4)+(B32*E32*4)+(B33*E33*4)+(B34*E34*4)","v":180},{"$f":"(B28*E28*4)+(B29*E29*4)+(B30*E30*4)+(B31*E31*4)+(B32*E32*4)+(B33*E33*4)+(B34*E34*4)","v":180},{"$f":"(((B28*E28*AO11)+(B29*E29*AO11)+(B30*E30*AO11)+(B31*E31*AO11)+(B32*E32*AO11)+(B33*E33*AO11)+(B34*E34*AO11))/60)","v":5.25},{"$f":"H282*AL7","v":393.75}]
[null,"HB  STRUT",null,{"$f":"(B39*F39*G39)+(B40*F40*G40)+(B41*F41*G41)+(B42*F42*G42)+(B43*F43*G43)+(B44*F44*G44)+(B45*F45*G45)+(B46*F46*G46)+(B47*F47*G47)+(B48*F48*G48)+(B49*F49*G49)+(B50*F50*G50)+(B51*F51*G51)+(B52*F52*G52)+(B53*F53*G53)+(B54*F54*G54)+(B55*F55*G55)+(B56*F56*G56)+(B57*F57*G57)+(B58*F58*G58)+(B59*F59*G59)","v":24},{"$f":"(B39*F39*4)+(B40*F40*4)+(B41*F41*4)+(B42*F42*4)+(B43*F43*4)+(B44*F44*4)+(B45*F45*4)+(B46*F46*4)+(B47*F47*4)+(B48*F48*4)+(B49*F49*4)+(B50*F50*4)+(B51*F51*4)+(B52*F52*4)+(B53*F53*4)+(B54*F54*4)+(B55*F55*4)+(B56*F56*4)+(B57*F57*4)+(B58*F58*4)+(B59*F59*4)","v":48},{"$f":"(B39*F39*4)+(B40*F40*4)+(B41*F41*4)+(B42*F42*4)+(B43*F43*4)+(B44*F44*4)+(B45*F45*4)+(B46*F46*4)+(B47*F47*4)+(B48*F48*4)+(B49*F49*4)+(B50*F50*4)+(B51*F51*4)+(B52*F52*4)+(B53*F53*4)+(B54*F54*4)+(B55*F55*4)+(B56*F56*4)+(B57*F57*4)+(B58*F58*4)+(B59*F59*4)","v":48},{"$f":"(B39*F39*4)+(B40*F40*4)+(B41*F41*4)+(B42*F42*4)+(B43*F43*4)+(B44*F44*4)+(B45*F45*4)+(B46*F46*4)+(B47*F47*4)+(B48*F48*4)+(B49*F49*4)+(B50*F50*4)+(B51*F51*4)+(B52*F52*4)+(B53*F53*4)+(B54*F54*4)+(B55*F55*4)+(B56*F56*4)+(B57*F57*4)+(B58*F58*4)+(B59*F59*4)","v":48},{"$f":"(((B39*F39*AO11)+(B40*F40*AO11)+(B41*F41*AO11)+(B42*F42*AO11)+(B43*F43*AO11)+(B44*F44*AO11)+(B45*F45*AO11)+(B46*F46*AO11)+(B47*F47*AO11)+(B48*F48*AO11)+(B49*F49*AO11)+(B50*F50*AO11)+(B51*F51*AO11)+(B52*F52*AO11)+(B53*F53*AO11)+(B54*F54*AO11)+(B55*F55*AO11)+(B56*F56*AO11)+(B57*F57*AO11)+(B58*F58*AO11)+(B59*F59*AO11))/60)","v":1.4},{"$f":"H283*AL7","v":105}]
[null,"HT  STRUT",null,{"$f":"(B64*F64*G64)+(B65*F65*G65)+(B66*F66*G66)+(B67*F67*G67)+(B68*F68*G68)+(B69*F69*G69)+(B70*F70*G70)+(B71*F71*G71)+(B72*F72*G72)+(B73*F73*G73)+(B74*F74*G74)+(B75*F75*G75)+(B76*F76*G76)+(B77*F77*G77)+(B78*F78*G78)+(B79*F79*G79)+(B80*F80*G80)+(B81*F81*G81)+(B82*F82*G82)+(B83*F83*G83)+(B84*F84*G84)","v":20},{"$f":"(B64*F64*4)+(B65*F65*4)+(B66*F66*4)+(B67*F67*4)+(B68*F68*4)+(B69*F69*4)+(B70*F70*4)+(B71*F71*4)+(B72*F72*4)+(B73*F73*4)+(B74*F74*4)+(B75*F75*4)+(B76*F76*4)+(B77*F77*4)+(B78*F78*4)+(B79*F79*4)+(B80*F80*4)+(B81*F81*4)+(B82*F82*4)+(B83*F83*4)+(B84*F84*4)","v":32},{"$f":"(B64*F64*4)+(B65*F65*4)+(B66*F66*4)+(B67*F67*4)+(B68*F68*4)+(B69*F69*4)+(B70*F70*4)+(B71*F71*4)+(B72*F72*4)+(B73*F73*4)+(B74*F74*4)+(B75*F75*4)+(B76*F76*4)+(B77*F77*4)+(B78*F78*4)+(B79*F79*4)+(B80*F80*4)+(B81*F81*4)+(B82*F82*4)+(B83*F83*4)+(B84*F84*4)","v":32},{"$f":"(B64*F64*4)+(B65*F65*4)+(B66*F66*4)+(B67*F67*4)+(B68*F68*4)+(B69*F69*4)+(B70*F70*4)+(B71*F71*4)+(B72*F72*4)+(B73*F73*4)+(B74*F74*4)+(B75*F75*4)+(B76*F76*4)+(B77*F77*4)+(B78*F78*4)+(B79*F79*4)+(B80*F80*4)+(B81*F81*4)+(B82*F82*4)+(B83*F83*4)+(B84*F84*4)","v":32},{"$f":"(((B64*F64*AO11)+(B65*F65*AO11)+(B66*F66*AO11)+(B67*F67*AO11)+(B68*F68*AO11)+(B69*F69*AO11)+(B70*F70*AO11)+(B71*F71*AO11)+(B72*F72*AO11)+(B73*F73*AO11)+(B74*F74*AO11)+(B75*F75*AO11)+(B76*F76*AO11)+(B77*F77*AO11)+(B78*F78*AO11)+(B79*F79*AO11)+(B80*F80*AO11)+(B81*F81*AO11)+(B82*F82*AO11)+(B83*F83*AO11)+(B84*F84*AO11))/60)","v":0.93333333333333335},{"$f":"H284*AL7","v":70},null,"VADJ QUANTITY SUMMARY"]
[null,"HX  STRUT",null,{"$f":"(B89*F89*G89)+(B90*F90*G90)+(B91*F91*G91)+(B92*F92*G92)+(B93*F93*G93)+(B94*F94*G94)+(B95*F95*G95)+(B96*F96*G96)+(B97*F97*G97)+(B98*F98*G98)+(B99*F99*G99)+(B100*F100*G100)+(B101*F101*G101)+(B102*F102*G102)+(B103*F103*G103)+(B104*F104*G104)+(B105*F105*G105)+(B106*F106*G106)+(B107*F107*G107)+(B108*F108*G108)+(B109*F109*G109)","v":0},{"$f":"(B89*F89*4)+(B90*F90*4)+(B91*F91*4)+(B92*F92*4)+(B93*F93*4)+(B94*F94*4)+(B95*F95*4)+(B96*F96*4)+(B97*F97*4)+(B98*F98*4)+(B99*F99*4)+(B100*F100*4)+(B101*F101*4)+(B102*F102*4)+(B103*F103*4)+(B104*F104*4)+(B105*F105*4)+(B106*F106*4)+(B107*F107*4)+(B108*F108*4)+(B109*F109*4)","v":0},{"$f":"(B89*F89*4)+(B90*F90*4)+(B91*F91*4)+(B92*F92*4)+(B93*F93*4)+(B94*F94*4)+(B95*F95*4)+(B96*F96*4)+(B97*F97*4)+(B98*F98*4)+(B99*F99*4)+(B100*F100*4)+(B101*F101*4)+(B102*F102*4)+(B103*F103*4)+(B104*F104*4)+(B105*F105*4)+(B106*F106*4)+(B107*F107*4)+(B108*F108*4)+(B109*F109*4)","v":0},{"$f":"(B89*F89*4)+(B90*F90*4)+(B91*F91*4)+(B92*F92*4)+(B93*F93*4)+(B94*F94*4)+(B95*F95*4)+(B96*F96*4)+(B97*F97*4)+(B98*F98*4)+(B99*F99*4)+(B100*F100*4)+(B101*F101*4)+(B102*F102*4)+(B103*F103*4)+(B104*F104*4)+(B105*F105*4)+(B106*F106*4)+(B107*F107*4)+(B108*F108*4)+(B109*F109*4)","v":0},{"$f":"(((B89*F89*AO11)+(B90*F90*AO11)+(B91*F91*AO11)+(B92*F92*AO11)+(B93*F93*AO11)+(B94*F94*AO11)+(B95*F95*AO11)+(B96*F96*AO11)+(B97*F97*AO11)+(B98*F98*AO11)+(B99*F99*AO11)+(B100*F100*AO11)+(B101*F101*AO11)+(B102*F102*AO11)+(B103*F103*AO11)+(B104*F104*AO11)+(B105*F105*AO11)+(B106*F106*AO11)+(B107*F107*AO11)+(B108*F108*AO11)+(B109*F109*AO11))/60)","v":0},{"$f":"H285*AL7","v":0},null,null,"SUPPORT QTY (pcs)","SUPPORT WEIGHT (lbs)","SUPPORT DESIGN TIME (hrs)","SUPPORT INSTAL TIME (hrs)","SUPPORT COST (usd)","CLAMPS QTY (pcs)","TOTAL HDWR QTY (pcs)",null,"CLAMP INSTAL TIME (hrs)","CLAMP INSTAL TIME COST (usd)"]
[null,"VI  STRUT",null,{"$f":"(B114*F114*G114)+(B115*F115*G115)+(B116*F116*G116)+(B117*F117*G117)+(B118*F118*G118)+(B119*F119*G119)+(B120*F120*G120)+(B121*F121*G121)+(B122*F122*G122)+(B123*F123*G123)+(B124*F124*G124)+(B125*F125*G125)+(B126*F126*G126)+(B127*F127*G127)+(B128*F128*G128)+(B129*F129*G129)+(B130*F130*G130)+(B131*F131*G131)+(B132*F132*G132)+(B133*F133*G133)+(B134*F134*G134)","v":26},{"$f":"(B114*F114*4)+(B115*F115*4)+(B116*F116*4)+(B117*F117*4)+(B118*F118*4)+(B119*F119*4)+(B120*F120*4)+(B121*F121*4)+(B122*F122*4)+(B123*F123*4)+(B124*F124*4)+(B125*F125*4)+(B126*F126*4)+(B127*F127*4)+(B128*F128*4)+(B129*F129*4)+(B130*F130*4)+(B131*F131*4)+(B132*F132*4)+(B133*F133*4)+(B134*F134*4)","v":48},{"$f":"(B114*F114*4)+(B115*F115*4)+(B116*F116*4)+(B117*F117*4)+(B118*F118*4)+(B119*F119*4)+(B120*F120*4)+(B121*F121*4)+(B122*F122*4)+(B123*F123*4)+(B124*F124*4)+(B125*F125*4)+(B126*F126*4)+(B127*F127*4)+(B128*F128*4)+(B129*F129*4)+(B130*F130*4)+(B131*F131*4)+(B132*F132*4)+(B133*F133*4)+(B134*F134*4)","v":48},{"$f":"(B114*F114*4)+(B115*F115*4)+(B116*F116*4)+(B117*F117*4)+(B118*F118*4)+(B119*F119*4)+(B120*F120*4)+(B121*F121*4)+(B122*F122*4)+(B123*F123*4)+(B124*F124*4)+(B125*F125*4)+(B126*F126*4)+(B127*F127*4)+(B128*F128*4)+(B129*F129*4)+(B130*F130*4)+(B131*F131*4)+(B132*F132*4)+(B133*F133*4)+(B134*F134*4)","v":48},{"$f":"(((B114*F114*AO11)+(B115*F115*AO11)+(B116*F116*AO11)+(B117*F117*AO11)+(B118*F118*AO11)+(B119*F119*AO11)+(B120*F120*AO11)+(B121*F121*AO11)+(B122*F122*AO11)+(B123*F123*AO11)+(B124*F124*AO11)+(B125*F125*AO11)+(B126*F126*AO11)+(B127*F127*AO11)+(B128*F128*AO11)+(B129*F129*AO11)+(B130*F130*AO11)+(B131*F131*AO11)+(B132*F132*AO11)+(B133*F133*AO11)+(B134*F134*AO11))/60)","v":1.4},{"$f":"H286*AL7","v":105}]
[null,"VO  STRUT",null,{"$f":"(B139*F139*G139)+(B140*F140*G140)+(B141*F141*G141)+(B142*F142*G142)+(B143*F143*G143)+(B144*F144*G144)+(B145*F145*G145)+(B146*F146*G146)+(B147*F147*G147)+(B148*F148*G148)+(B149*F149*G149)+(B150*F150*G150)+(B151*F151*G151)+(B152*F152*G152)+(B153*F153*G153)+(B154*F154*G154)+(B155*F155*G155)+(B156*F156*G156)+(B157*F157*G157)+(B158*F158*G158)+(B159*F159*G159)","v":26},{"$f":"(B139*F139*4)+(B140*F140*4)+(B141*F141*4)+(B142*F142*4)+(B143*F143*4)+(B144*F144*4)+(B145*F145*4)+(B146*F146*4)+(B147*F147*4)+(B148*F148*4)+(B149*F149*4)+(B150*F150*4)+(B151*F151*4)+(B152*F152*4)+(B153*F153*4)+(B154*F154*4)+(B155*F155*4)+(B156*F156*4)+(B157*F157*4)+(B158*F158*4)+(B159*F159*4)","v":48},{"$f":"(B139*F139*4)+(B140*F140*4)+(B141*F141*4)+(B142*F142*4)+(B143*F143*4)+(B144*F144*4)+(B145*F145*4)+(B146*F146*4)+(B147*F147*4)+(B148*F148*4)+(B149*F149*4)+(B150*F150*4)+(B151*F151*4)+(B152*F152*4)+(B153*F153*4)+(B154*F154*4)+(B155*F155*4)+(B156*F156*4)+(B157*F157*4)+(B158*F158*4)+(B159*F159*4)","v":48},{"$f":"(B139*F139*4)+(B140*F140*4)+(B141*F141*4)+(B142*F142*4)+(B143*F143*4)+(B144*F144*4)+(B145*F145*4)+(B146*F146*4)+(B147*F147*4)+(B148*F148*4)+(B149*F149*4)+(B150*F150*4)+(B151*F151*4)+(B152*F152*4)+(B153*F153*4)+(B154*F154*4)+(B155*F155*4)+(B156*F156*4)+(B157*F157*4)+(B158*F158*4)+(B159*F159*4)","v":48},{"$f":"(((B139*F139*AO11)+(B140*F140*AO11)+(B141*F141*AO11)+(B142*F142*AO11)+(B143*F143*AO11)+(B144*F144*AO11)+(B145*F145*AO11)+(B146*F146*AO11)+(B147*F147*AO11)+(B148*F148*AO11)+(B149*F149*AO11)+(B150*F150*AO11)+(B151*F151*AO11)+(B152*F152*AO11)+(B153*F153*AO11)+(B154*F154*AO11)+(B155*F155*AO11)+(B156*F156*AO11)+(B157*F157*AO11)+(B158*F158*AO11)+(B159*F159*AO11))/60)","v":1.4},{"$f":"H287*AL7","v":105},null,"SUM TOTALS:",{"$f":"T192","v":0},{"$f":"U192","v":0},{"$f":"W192","v":0},{"$f":"X192","v":0},{"$f":"V192","v":0},{"$f":"AB192","v":0},{"$f":"AC192","v":0},null,{"$f":"AN192","v":0},{"$f":"AO192","v":0}]
[null,"4\" EXP KIT  STRUT",null,{"$f":"(B164*F164*G164)+(B165*F165*G165)+(B166*F166*G166)+(B167*F167*G167)+(B168*F168*G168)+(B169*F169*G169)+(B170*F170*G170)","v":0},{"$f":"(B164*F164*4)+(B165*F165*4)+(B166*F166*4)+(B167*F167*4)+(B168*F168*4)+(B169*F169*4)+(B170*F170*4)","v":0},{"$f":"(B164*F164*4)+(B165*F165*4)+(B166*F166*4)+(B167*F167*4)+(B168*F168*4)+(B169*F169*4)+(B170*F170*4)","v":0},{"$f":"(B164*F164*4)+(B165*F165*4)+(B166*F166*4)+(B167*F167*4)+(B168*F168*4)+(B169*F169*4)+(B170*F170*4)","v":0},{"$f":"(((B164*F164*AO11)+(B165*F165*AO11)+(B166*F166*AO11)+(B167*F167*AO11)+(B168*F168*AO11)+(B169*F169*AO11)+(B170*F170*AO11))/60)","v":0},{"$f":"H288*AL7","v":0}]
[null,"6\" EXP KIT  STRUT",null,{"$f":"(B175*F175*G175)+(B176*F176*G176)+(B177*F177*G177)+(B178*F178*G178)+(B179*F179*G179)+(B180*F180*G180)+(B181*F181*G181)","v":65},{"$f":"(B175*F175*4)+(B176*F176*4)+(B177*F177*4)+(B178*F178*4)+(B179*F179*4)+(B180*F180*4)+(B181*F181*4)","v":120},{"$f":"(B175*F175*4)+(B176*F176*4)+(B177*F177*4)+(B178*F178*4)+(B179*F179*4)+(B180*F180*4)+(B181*F181*4)","v":120},{"$f":"(B175*F175*4)+(B176*F176*4)+(B177*F177*4)+(B178*F178*4)+(B179*F179*4)+(B180*F180*4)+(B181*F181*4)","v":120},{"$f":"(((B175*F175*AO11)+(B176*F176*AO11)+(B177*F177*AO11)+(B178*F178*AO11)+(B179*F179*AO11)+(B180*F180*AO11)+(B181*F181*AO11))/60)","v":3.5},{"$f":"H289*AL7","v":262.5},null,"HADJ + VADJ TOTALS:",{"$f":"L281+L287","v":0},0,0,0,0,0,0,null,{"$f":"T281+T287","v":0},{"$f":"U281+U287","v":0}]
[null,"HADJ  STRUT",null,{"$f":"(B186*F186*G186)","v":0},{"$f":"(B186*F186*4)","v":0},{"$f":"(B186*F186*4)","v":0},{"$f":"(B186*F186*4)","v":0},{"$f":"(((B186*F186*AO11))/60)","v":0},{"$f":"H290*AL7","v":0},null,"REDUCER QUANTITY SUMMARY"]
[null,"VADJ  STRUT",null,{"$f":"(B191*F191*G191)","v":0},{"$f":"(B191*F191*4)","v":0},{"$f":"(B191*F191*4)","v":0},{"$f":"(B191*F191*4)","v":0},{"$f":"(((B191*F191*AO11))/60)","v":0},{"$f":"H291*AL7","v":0},null,null,"SUPPORT QTY (pcs)","SUPPORT WEIGHT (lbs)","SUPPORT DESIGN TIME (hrs)","SUPPORT INSTAL TIME (hrs)","SUPPORT COST (usd)","CLAMPS QTY (pcs)","TOTAL HDWR QTY (pcs)",null,"CLAMP INSTAL TIME (hrs)","CLAMP INSTAL TIME COST (usd)"]
[null,"REDUCER  STRUT",null,{"$f":"(B196*F196*G196)","v":0},{"$f":"(B196*F196*4)","v":0},{"$f":"(B196*F196*4)","v":0},{"$f":"(B196*F196*4)","v":0},{"$f":"(((B196*F196*AO11))/60)","v":0},{"$f":"H292*AL7","v":0}]
[null,null,null,null,null,null,null,null,null,null,"SUM TOTALS:",{"$f":"T197","v":0},{"$f":"U197","v":0},{"$f":"W197","v":0},{"$f":"X197","v":0},{"$f":"V197","v":0},{"$f":"AB197","v":0},{"$f":"AC197","v":0},null,{"$f":"AN197","v":0},{"$f":"AO197","v":0}]
[null,"SUM TOTALS:",null,{"$f":"SUM(D281:D292)","v":258.5},476,476,476,13.883333333333335,1041.25]
[]
[null,null,null,null,null,null,null,null,null,null,"OPTIMIZED SPANS : for 20ft STRAIGHT SECTIONS"]
["STRUT TRAPEZE SUPPORT : STRUT COST & WEIGHT",null,null,null,null,null,null,null,null,null,"SPAN","SUPPORT QTY (pcs)","SUPPORT WEIGHT (lbs)","SUPPORT COST (usd)","SUPPORT INSTAL TIME (hrs)","SPLICE QTY (pcs)","CLAMP QTY (prs)","GUIDE QTY (prs)",null,"HDWR QTY (pcs)","TRAY INSTAL TIME (hrs)","TRAY INSTAL COST (usd)","OPTIMIZATION FACTOR (%)"]
[null,"ITEM",null,"STRUT CHANNEL WEIGHT (lbs)",null,"TOTAL ATR WEIGHT (lbs)",null,"STRUT CHANNEL COST (usd)","TOTAL ATR COST (usd)"]
[null,null,null,null,null,null,null,null,null,null,"10ft",{"$f":"G35*2","v":195},{"$f":"H35*2","v":741},{"$f":"M35*2","v":5742.75},{"$f":"X35*2","v":22.5},{"$f":"Z35","v":45},{"$f":"AB35*2","v":29.996999999999996},{"$f":"AD35*2","v":69.992999999999995},null,{"$f":"SUM((AA35)+((AC35+AE35)*2))","v":1127.9880000000001},{"$f":"SUM(((AK35)+(AL35+AM35))/60)*2","v":0.18055000000000002},{"$f":"U299*AL6","v":13.541250000000002},{"$f":"(L299-L299)/L299","v":0}]
[null,"4\" ST SC  STRUT",null,{"$f":"D281*G11","v":0},null,{"$f":"E281*'CTI Input Sheet'!C10","v":0},null,{"$f":"D281*G13","v":0},{"$f":"E281*'CTI Input Sheet'!E10","v":0},null,"12ft",{"$f":"G35*1.8","v":175.5},{"$f":"M304*1.8","v":666.9},{"$f":"N304*1.8","v":5168.4750000000004},{"$f":"O304*1.8","v":20.25},{"$f":"Z35","v":45},{"$f":"AB35*1.8","v":26.997299999999996},{"$f":"AD35*1.8","v":62.993699999999997},null,{"$f":"SUM((AA35)+((AC35+AE35)*1.8))","v":1087.1892},{"$f":"SUM(((AK35)+(AL35+AM35))/60)*1.8","v":0.16249500000000003},{"$f":"U300*AL6","v":12.187125000000002},{"$f":"(L299-L300)/L299","v":0.1}]
[null,"6\" ST SC  STRUT",null,{"$f":"D282*G11","v":370.5},null,{"$f":"E282*'CTI Input Sheet'!C10","v":37.799999999999997},null,{"$f":"D282*G13","v":2223},{"$f":"E282*'CTI Input Sheet'!E10","v":453.6},null,"14ft",{"$f":"G35*1.6","v":156},{"$f":"M304*1.6","v":592.80000000000007},{"$f":"N304*1.6","v":4594.2},{"$f":"O304*1.6","v":18},{"$f":"Z35","v":45},{"$f":"AB35*1.6","v":23.997599999999998},{"$f":"AD35*1.6","v":55.994399999999999},null,{"$f":"SUM((AA35)+((AC35+AE35)*1.6))","v":1046.3904},{"$f":"SUM(((AK35)+(AL35+AM35))/60)*1.6","v":0.14444000000000001},{"$f":"U301*AL6","v":10.833},{"$f":"(L299-L301)/L299","v":0.2}]
[null,"HB  STRUT",null,{"$f":"D283*G11","v":91.199999999999989},null,{"$f":"E283*'CTI Input Sheet'!C10","v":10.08},null,{"$f":"D283*G13","v":547.20000000000005},{"$f":"E283*'CTI Input Sheet'!E10","v":120.96000000000001},null,"16ft",{"$f":"G35*1.4","v":136.5},{"$f":"M304*1.4","v":518.69999999999993},{"$f":"N304*1.4","v":4019.9249999999997},{"$f":"O304*1.4","v":15.749999999999998},{"$f":"Z35","v":45},{"$f":"AB35*1.4","v":20.997899999999998},{"$f":"AD35*1.4","v":48.995099999999994},null,{"$f":"SUM((AA35)+((AC35+AE35)*1.4))","v":1005.5916},{"$f":"SUM(((AK35)+(AL35+AM35))/60)*1.4","v":0.126385},{"$f":"U302*AL6","v":9.4788750000000004},{"$f":"(L299-L302)/L299","v":0.3}]
[null,"HT  STRUT",null,{"$f":"D284*G11","v":76},null,{"$f":"E284*'CTI Input Sheet'!C10","v":6.72},null,{"$f":"D284*G13","v":456},{"$f":"E284*'CTI Input Sheet'!E10","v":80.64},null,"18ft",{"$f":"G35*1.2","v":117},{"$f":"M304*1.2","v":444.59999999999997},{"$f":"N304*1.2","v":3445.65},{"$f":"O304*1.2","v":13.5},{"$f":"Z35","v":45},{"$f":"AB35*1.2","v":17.998199999999997},{"$f":"AD35*1.2","v":41.995799999999996},null,{"$f":"SUM((AA35)+((AC35+AE35)*1.2))","v":964.79279999999994},{"$f":"SUM(((AK35)+(AL35+AM35))/60)*1.2","v":0.10833000000000001},{"$f":"U303*AL6","v":8.1247500000000006},{"$f":"(L299-L303)/L299","v":0.4}]
[null,"HX  STRUT",null,{"$f":"D285*G11","v":0},null,{"$f":"E285*'CTI Input Sheet'!C10","v":0},null,{"$f":"D285*G13","v":0},{"$f":"E285*'CTI Input Sheet'!E10","v":0},null,"20ft",{"$f":"G35","v":97.5},{"$f":"H35","v":370.5},{"$f":"M35","v":2871.375},{"$f":"X35","v":11.25},{"$f":"Z35","v":45},{"$f":"AB35","v":14.998499999999998},{"$f":"AD35","v":34.996499999999997},null,{"$f":"SUM(AA35)+(AC35+AE35)","v":923.99400000000003},{"$f":"SUM((AK35)+(AL35+AM35))/60","v":9.0275000000000008E-2},{"$f":"U304*AL6","v":6.7706250000000008},{"$f":"(L299-L304)/L299","v":0.5}]
[null,"VI  STRUT",null,{"$f":"D286*G11","v":98.8},null,{"$f":"E286*'CTI Input Sheet'!C10","v":10.08},null,{"$f":"D286*G13","v":592.80000000000007},{"$f":"E286*'CTI Input Sheet'!E10","v":120.96000000000001}]
[null,"VO  STRUT",null,{"$f":"D287*G11","v":98.8},null,{"$f":"E287*'CTI Input Sheet'!C10","v":10.08},null,{"$f":"D287*G13","v":592.80000000000007},{"$f":"E287*'CTI Input Sheet'!E10","v":120.96000000000001}]
[null,"4\" EXP KIT  STRUT",null,{"$f":"D288*G11","v":0},null,{"$f":"E288*'CTI Input Sheet'!C10","v":0},null,{"$f":"D288*G13","v":0},{"$f":"E288*'CTI Input Sheet'!E10","v":0},null,"OPTIMIZED SPANS : for 12ft STRAIGHT SECTIONS"]
[null,"6\" EXP KIT  STRUT",null,{"$f":"D289*G11","v":247},null,{"$f":"E289*'CTI Input Sheet'!C10","v":25.2},null,{"$f":"D289*G13","v":1482},{"$f":"E289*'CTI Input Sheet'!E10","v":302.39999999999998},null,"SPAN","SUPPORT QTY (pcs)","SUPPORT WEIGHT (lbs)","SUPPORT COST (usd)","SUPPORT INSTAL TIME (hrs)","SPLICE QTY (pcs)","CLAMP QTY (prs)","GUIDE QTY (prs)",null,"HDWR QTY (pcs)","TRAY INSTAL TIME (hrs)","TRAY INSTAL COST (usd)","OPTIMIZATION FACTOR (%)"]
[null,"HADJ  STRUT",null,{"$f":"D290*G11","v":0},null,{"$f":"E290*'CTI Input Sheet'!C10","v":0},null,{"$f":"D290*G13","v":0},{"$f":"E290*'CTI Input Sheet'!E10","v":0}]
[null,"VADJ  STRUT",null,{"$f":"D291*G11","v":0},null,{"$f":"E291*'CTI Input Sheet'!C10","v":0},null,{"$f":"D291*G13","v":0},{"$f":"E291*'CTI Input Sheet'!E10","v":0},null,"5ft",{"$f":"G24*2","v":0},{"$f":"H24*2","v":0},{"$f":"M24*2","v":0},{"$f":"X24*2","v":0},{"$f":"Z24","v":0},{"$f":"AB24*2","v":0},{"$f":"AD24*2","v":0},null,{"$f":"SUM((AA24)+((AC24+AE24)*2))","v":0},{"$f":"SUM(((AK24)+(AL24+AM24))/60)*2","v":0},{"$f":"U310*AL6","v":0},{"$f":"(L310-L310)/L310","v":{"$error":"#DIV/0!"}}]
[null,"REDUCER  STRUT",null,{"$f":"D292*G11","v":0},null,{"$f":"E292*'CTI Input Sheet'!C10","v":0},null,{"$f":"D292*G13","v":0},{"$f":"E292*'CTI Input Sheet'!E10","v":0},null,"6ft",{"$f":"G24*1.8","v":0},{"$f":"M315*1.8","v":0},{"$f":"M24*1.8","v":0},{"$f":"X24*1.8","v":0},{"$f":"Z24","v":0},{"$f":"AB24*1.8","v":0},{"$f":"AD24*1.8","v":0},null,{"$f":"SUM((AA24)+((AC24+AE24)*1.8))","v":0},{"$f":"SUM(((AK24)+(AL24+AM24))/60)*1.8","v":0},{"$f":"U311*AL6","v":0},{"$f":"(L310-L311)/L310","v":{"$error":"#DIV/0!"}}]
[null,null,null,null,null,null,null,null,null,null,"7ft",{"$f":"G24*1.6","v":0},{"$f":"M315*1.6","v":0},{"$f":"M24*1.6","v":0},{"$f":"X24*1.6","v":0},{"$f":"Z24","v":0},{"$f":"AB24*1.6","v":0},{"$f":"AD24*1.6","v":0},null,{"$f":"SUM((AA24)+((AC24+AE24)*1.6))","v":0},{"$f":"SUM(((AK24)+(AL24+AM24))/60)*1.6","v":0},{"$f":"U312*AL6","v":0},{"$f":"(L310-L312)/L310","v":{"$error":"#DIV/0!"}}]
[null,"SUM TOTALS:",null,{"$f":"SUM(D300:D311)","v":982.3},null,{"$f":"SUM(F300:F311)","v":99.96},null,{"$f":"SUM(H300:H311)","v":5893.8},{"$f":"SUM(I300:I311)","v":1199.52},null,"8ft",{"$f":"G24*1.4","v":0},{"$f":"M315*1.4","v":0},{"$f":"M24*1.4","v":0},{"$f":"X24*1.4","v":0},{"$f":"Z24","v":0},{"$f":"AB24*1.4","v":0},{"$f":"AD24*1.4","v":0},null,{"$f":"SUM((AA24)+((AC24+AE24)*1.4))","v":0},{"$f":"SUM(((AK24)+(AL24+AM24))/60)*1.4","v":0},{"$f":"U313*AL6","v":0},{"$f":"(L310-L313)/L310","v":{"$error":"#DIV/0!"}}]
[null,null,null,null,null,null,null,null,null,null,"10ft",{"$f":"G24*1.2","v":0},{"$f":"M315*1.2","v":0},{"$f":"M24*1.2","v":0},{"$f":"X24*1.2","v":0},{"$f":"Z24","v":0},{"$f":"AB24*1.2","v":0},{"$f":"AD24*1.2","v":0},null,{"$f":"SUM((AA24)+((AC24+AE24)*1.2))","v":0},{"$f":"SUM(((AK24)+(AL24+AM24))/60)*1.2","v":0},{"$f":"U314*AL6","v":0},{"$f":"(L310-L314)/L310","v":{"$error":"#DIV/0!"}}]
[null,null,null,null,null,null,null,null,null,null,"12ft",{"$f":"G24","v":0},{"$f":"H24","v":0},{"$f":"M24","v":0},{"$f":"X24","v":0},{"$f":"Z24","v":0},{"$f":"AB24","v":0},{"$f":"AD24","v":0},null,{"$f":"SUM(AA24)+(AC24+AE24)","v":0},{"$f":"SUM((AK24)+(AL24+AM24))/60","v":0},{"$f":"U315*AL6","v":0},{"$f":"(L310-L315)/L310","v":{"$error":"#DIV/0!"}}]
["STRUT TRAPEZE SUPPORT : TRAY CLAMPS & GUIDES"]
[null,"ITEM",null,"TRAY CLAMP QTY (prs)","TRAY GUIDE QTY (prs)","TOTAL HDWR QTY (pcs)","TOTAL INSTAL TIME (hrs)","INSTAL TIME COST (usd)"]
[]
[null,"4\" ST SC  STRUT",null,{"$f":"AB24","v":0},{"$f":"AD24","v":0},{"$f":"(AC24+AE24)","v":0},{"$f":"(AL24+AM24)/60","v":0},{"$f":"G319*AL6","v":0}]
[null,"6\" ST SC  STRUT",null,{"$f":"AB35","v":14.998499999999998},{"$f":"AD35","v":34.996499999999997},{"$f":"(AC35+AE35)","v":203.994},{"$f":"(AL35+AM35)/60","v":2.7775000000000001E-2},{"$f":"G320*AL6","v":2.0831249999999999}]
[null,"HB  STRUT",null,{"$f":"AB60","v":12},{"$f":"AD60","v":0},{"$f":"(AC60+AE60)","v":48},{"$f":"(AL60+AM60)/60","v":6.6666666666666671E-3},{"$f":"G321*AL6","v":0.5}]
[null,"HT  STRUT",null,{"$f":"AB85","v":9},{"$f":"AD85","v":0},{"$f":"(AC85+AE85)","v":36},{"$f":"(AL85+AM85)/60","v":5.0000000000000001E-3},{"$f":"G322*AL6","v":0.375}]
[null,"HX  STRUT",null,{"$f":"AB110","v":0},{"$f":"AD110","v":0},{"$f":"(AC110+AE110)","v":0},{"$f":"(AL110+AM110)/60","v":0},{"$f":"G323*AL6","v":0}]
[null,"VI  STRUT",null,{"$f":"AB135","v":12},{"$f":"AD135","v":0},{"$f":"(AC135+AE135)","v":48},{"$f":"(AL135+AM135)/60","v":6.6666666666666671E-3},{"$f":"G324*AL6","v":0.5}]
[null,"VO  STRUT",null,{"$f":"AB160","v":12},{"$f":"AD160","v":0},{"$f":"(AC160+AE160)","v":48},{"$f":"(AL160+AM160)/60","v":6.6666666666666671E-3},{"$f":"G325*AL6","v":0.5}]
[null,"4\" EXP KIT  STRUT",null,{"$f":"AB171","v":0},{"$f":"AD171","v":0},{"$f":"(AC171+AE171)","v":0},{"$f":"(AL180+AM171)/60","v":0},{"$f":"G326*AL6","v":0}]
[null,"6\" EXP KIT  STRUT",null,{"$f":"AB182","v":0},{"$f":"AD182","v":30},{"$f":"(AC182+AE182)","v":120},{"$f":"(AL182+AM182)/60","v":1.6666666666666666E-2},{"$f":"G327*AL6","v":1.25}]
[null,"HADJ  STRUT",null,{"$f":"AB187","v":0},{"$f":"AD187","v":0},{"$f":"(AC187+AE187)","v":0},{"$f":"(AL187+AM187)/60","v":0},{"$f":"G328*AL6","v":0}]
[null,"VADJ  STRUT",null,{"$f":"AB192","v":0},{"$f":"AD192","v":0},{"$f":"(AC192+AE192)","v":0},{"$f":"(AL192+AM192)/60","v":0},{"$f":"G329*AL6","v":0}]
[null,"REDUCER  STRUT",null,{"$f":"AB197","v":0},{"$f":"AD197","v":0},{"$f":"(AC197+AE197)","v":0},{"$f":"(AL197+AM197)/60","v":0},{"$f":"G330*AL6","v":0}]
[]
[null,"SUM TOTALS:",null,{"$f":"SUM(D319:D330)","v":59.9985},{"$f":"SUM(E319:E330)","v":64.996499999999997},{"$f":"SUM(F319:F330)","v":503.99400000000003},{"$f":"SUM(G319:G330)","v":6.9441666666666665E-2},{"$f":"SUM(H319:H330)","v":5.2081249999999999}]

{"sheet":"TSS","index":6,"n_rows":334,"n_cols":49,"rows_kept":334,"cut":false,"hidden":true,"merged":[[315,0,315,8],[306,10,306,22],[295,10,295,22],[277,0,277,8],[3,42,3,48],[277,10,277,20],[283,10,283,20],[289,10,289,20],[258,10,258,19],[14,42,14,48],[25,42,25,48],[36,42,36,48],[61,42,61,48],[86,42,86,48],[111,42,111,48],[136,42,136,48],[193,19,193,23],[193,25,193,30],[193,32,193,34],[224,12,224,14],[247,12,247,14],[247,16,247,19],[193,36,193,40],[188,19,188,23],[188,25,188,30],[188,32,188,34],[188,36,188,40],[189,3,189,4],[183,19,183,23],[183,25,183,30],[183,32,183,34],[183,36,183,40],[184,3,184,4],[3,1,10,1],[3,14,3,15],[3,19,3,20],[3,39,3,40],[8,10,8,12],[11,25,11,27],[11,36,11,37],[3,16,3,17],[6,6,6,8],[8,3,8,8],[11,6,11,8],[111,36,111,40],[14,3,14,12],[14,14,14,15],[14,25,14,30],[14,32,14,34],[86,19,86,23],[86,3,86,4],[86,5,86,17],[61,3,61,4],[61,5,61,16],[61,25,61,30],[61,32,61,34],[61,19,61,23],[36,3,36,4],[36,5,36,15],[36,25,36,30],[14,19,14,23],[25,19,25,23],[36,19,36,23],[25,3,25,12],[25,25,25,30],[172,19,172,23],[172,25,172,30],[172,32,172,34],[172,36,172,40],[14,36,14,40],[111,19,111,23],[136,19,136,23],[161,19,161,23],[86,36,86,40],[61,36,61,40],[25,36,25,40],[36,32,36,34],[36,36,36,40],[86,25,86,30],[86,32,86,34],[25,32,25,34],[136,25,136,30],[136,32,136,34],[136,36,136,40],[161,25,161,30],[161,32,161,34],[161,36,161,40],[111,25,111,30],[111,32,111,34],[12,6,12,8],[296,0,296,8],[207,0,207,6],[258,0,258,8],[172,3,172,4],[172,5,172,14],[183,3,183,4],[183,5,183,15],[185,3,185,4],[188,3,188,4],[188,5,188,15],[190,3,190,4],[192,5,192,15],[193,3,193,4],[195,3,195,4],[25,14,25,15],[136,3,136,4],[136,5,136,14],[161,3,161,4],[161,5,161,14],[111,3,111,4],[111,5,111,14],[194,3,194,4]]}
[null,"TSS Structural Support Calculator"]
[]
[null,null,null,null,null,null,null,null,null,null,null,null,null,null,"MTO Expansion Joint Calculation ",null,null,null,null,null,null,null,null,null,null,"Logistic Rates",null,null,null,null,null,null,"Tray Accessory Costs ",null,null,null,"Customer Skilled Labor Rates",null,null,"Tray Installation Times ",null,null,"Cover Clamp Costs & Installation Times & Weights"]
[null,null,null,null,null,null,null,null,null,null,null,null,null,null,"4in Height Expansion Joint Quantities",null,"6in Height Expansion Joint Quantities",null,null,null,null,null,null,null,null,"Logistic Costs (USD)",null,null,null,null,null,null,"Cable Tray Accessory Costs (USD)",null,null,null,"Project Labor Cost (USD/HOUR)",null,null,"Tray Accessory Installation Time (Minutes)",null,null,"Cover Clamp Costs (USD) & Installation Times (MIN) & Weights (LBS)"]
[null,null,null,null,null,null,null,null,null,null,null,null,null,null,"Cable Tray Width (in)","Expansion Splice Qty (PR) ","Cable Tray Width (in)","Expansion Splice Qty (PR) ",null,null,null,null,null,null,null,"Logistic Type","Allocated Cost",null,null,null,null,null,"Cable Tray Accessory","TOUGHTray Costs",null,null,"Skilled Worker Discipline","Labor Hourly Work Rate ",null,"Cable Tray Accessory","Allocated Installation Time",null,"Cover Clamp Width","Fitting Cover Kit Cost (USD)","Fitting Cover Kit Instal (MIN)","TOUGHTorx Cost (Ea/USD)","Installation Time (MIN)","Fitting Cover Kit Weight (LBS)","TOUGHTorx Weight (LBS)"]
[null,null,null,null,null,null,null,null,null,null,null,null,null,null,6,{"$f":"ROUNDDOWN(((B17*12)/72),0)","v":0},6,{"$f":"ROUNDDOWN(((B28*20)/60),0)","v":0},null,null,null,null,null,null,null,"20ft Flat Bed Truck",{"$f":"'CTI Input Sheet'!H12","v":5500},null,null,null,null,null,"4\" Expansion Kit Cartridge (PRS)",{"$f":"'CTI Input Sheet'!D20","v":25},null,null,"Cable Tray Installer",{"$f":"'CTI Input Sheet'!H5","v":75},null,"TOUGHLink (PR)",{"$f":"'CTI Input Sheet'!K6","v":1},null,"6\" Width",{"$f":"'CTI Input Sheet'!N16","v":1},{"$f":"'CTI Input Sheet'!O16","v":0.2},{"$f":"'CTI Input Sheet'!P16","v":1},{"$f":"'CTI Input Sheet'!Q16","v":0.08},{"$f":"'CTI Input Sheet'!R16","v":0.1},{"$f":"'CTI Input Sheet'!S16","v":0.02}]
[null,null,null,null,null,null,null,null,null,null,null,null,null,null,9,0,9,0,null,null,null,null,null,null,null,"40ft Flat Bed Truck",{"$f":"'CTI Input Sheet'!H13","v":8000},null,null,null,null,null,"6\" Expansion Kit Cartridge (PRS)",{"$f":"'CTI Input Sheet'!D21","v":30},null,null,"Steel Erector",{"$f":"'CTI Input Sheet'!H6","v":75},null,"Expansion Cartridge 4-inch (PR)",{"$f":"'CTI Input Sheet'!K10","v":1},null,"9\" Width",{"$f":"'CTI Input Sheet'!N17","v":1},{"$f":"'CTI Input Sheet'!O17","v":0.2},{"$f":"'CTI Input Sheet'!P17","v":1},{"$f":"'CTI Input Sheet'!Q17","v":0.08},{"$f":"'CTI Input Sheet'!R17","v":0.1},{"$f":"'CTI Input Sheet'!S17","v":0.02}]
[null,null,null,"Support Structural Sections",null,null,null,null,null,null,null,null,null,null,12,0,12,10,null,null,null,null,null,null,null,"40ft Ocean Container",{"$f":"'CTI Input Sheet'!H14","v":10000},null,null,null,null,null,"Hold Down Clamps (PRS)",{"$f":"'CTI Input Sheet'!D14","v":6},null,null,"Design Engineer",{"$f":"'CTI Input Sheet'!H7","v":75},null,"Hold Down Clamps (PR)",{"$f":"'CTI Input Sheet'!K7","v":2},null,"12\" Width",{"$f":"'CTI Input Sheet'!N18","v":1},{"$f":"'CTI Input Sheet'!O18","v":0.2},{"$f":"'CTI Input Sheet'!P18","v":1},{"$f":"'CTI Input Sheet'!Q18","v":0.08},{"$f":"'CTI Input Sheet'!R18","v":0.1},{"$f":"'CTI Input Sheet'!S18","v":0.02}]
[null,null,null,"Cable Tray Support Structural Section",null,null,null,null,null,null,null,null,null,null,18,0,18,0,null,null,null,null,null,null,null,null,null,null,null,null,null,null,"Clamp Hardware  (PCS)",{"$f":"'CTI Input Sheet'!D15","v":1.25},null,null,null,null,null,"Expansion Guides (PR)",{"$f":"'CTI Input Sheet'!K8","v":2},null,"18\" Width",{"$f":"'CTI Input Sheet'!N19","v":1},{"$f":"'CTI Input Sheet'!O19","v":0.2},{"$f":"'CTI Input Sheet'!P19","v":1},{"$f":"'CTI Input Sheet'!Q19","v":0.08},{"$f":"'CTI Input Sheet'!R19","v":0.1},{"$f":"'CTI Input Sheet'!S19","v":0.02}]
[null,null,null,"Type","Type #","Dimension","Section Weight LB/FT","Support Instal Time MIN/PC","Section Cost USD/FT",null,null,null,null,null,24,0,24,0,null,null,null,null,null,null,null,null,null,null,null,null,null,null,"Expansion Guides (PR)",{"$f":"'CTI Input Sheet'!D16","v":6},null,null,null,null,null,"Expansion Cartridge 6-inch (PR)",{"$f":"'CTI Input Sheet'!K11","v":1},null,"24\" Width",{"$f":"'CTI Input Sheet'!N20","v":1},{"$f":"'CTI Input Sheet'!O20","v":0.2},{"$f":"'CTI Input Sheet'!P20","v":1},{"$f":"'CTI Input Sheet'!Q20","v":0.08},{"$f":"'CTI Input Sheet'!R20","v":0.1},{"$f":"'CTI Input Sheet'!S20","v":0.02}]
[null,null,null,"Straight Section Support",{"$f":"ProjectData!E13","v":"Double Strut (12G)"},null,{"$f":"INDEX('CTI Input Sheet'!C5:C10,MATCH('VE2'!E11,'CTI Input Sheet'!B5:B10,0))","v":3.8},{"$f":"INDEX('CTI Input Sheet'!D5:D10,MATCH('VE2'!E11,'CTI Input Sheet'!B5:B10,0))","v":15},{"$f":"INDEX('CTI Input Sheet'!E5:E10,MATCH('VE2'!E11,'CTI Input Sheet'!B5:B10,0))","v":5.7},null,null,null,null,null,30,0,30,0,null,null,null,null,null,null,null,null,null,null,null,null,null,null,"Guide Hardware (PCS)",{"$f":"'CTI Input Sheet'!D17","v":1.25},null,null,null,null,null,"Structural Support (EA)",{"$f":"'CTI Input Sheet'!K14","v":60},null,"30\" Width",{"$f":"'CTI Input Sheet'!N21","v":1},{"$f":"'CTI Input Sheet'!O21","v":0.2},{"$f":"'CTI Input Sheet'!P21","v":1},{"$f":"'CTI Input Sheet'!Q21","v":0.08},{"$f":"'CTI Input Sheet'!R21","v":0.1},{"$f":"'CTI Input Sheet'!S21","v":0.02}]
[null,null,null,"Support Finish",{"$f":"ProjectData!E17","v":"Stainless"},null,{"$f":"INDEX('CTI Input Sheet'!H21:H24,MATCH('VE2'!E12,'CTI Input Sheet'!G21:G24,0))","v":4},null,null,null,null,null,null,null,36,0,36,5,null,null,null,null,null,null,null,null,null,null,null,null,null,null,"TOUGHLink Hardware (PCS)",{"$f":"'CTI Input Sheet'!D23","v":1.5},null,null,null,null,null,"TSS Strut ATR Support (EA)",{"$f":"'CTI Input Sheet'!K13","v":2},null,"36\" Width",{"$f":"'CTI Input Sheet'!N22","v":1},{"$f":"'CTI Input Sheet'!O22","v":0.2},{"$f":"'CTI Input Sheet'!P22","v":1},{"$f":"'CTI Input Sheet'!Q22","v":0.08},{"$f":"'CTI Input Sheet'!R22","v":0.1},{"$f":"'CTI Input Sheet'!S22","v":0.02}]
[null,null,null,null,null,null,{"$f":"G12*I11","v":22.8}]
[]
[null,"4in Straight Sections",null,"TSS : 4in Height Straight Section Support Quantity - Support Weight - Support Steel Fabrication, Logistics, Erection Costs",null,null,null,null,null,null,null,null,null,null,null,null,null,null,null,"4\" Straight Section : Support Structure Summary",null,null,null,null,null,"4\" Straight Section : Tray Accessory Quantities ",null,null,null,null,null,null,"4\" Straight Section : Tray Accessory Costs ",null,null,null,"4\" Straight Section : Tray Accessory Installation Time & Installation Cost",null,null,null,null,null,"4\" Straight Section : Covers"]
[null,"Quantities/Piece",null,"Tray Width (in)","Support Quantity","Section Length (FT)","Total Str. Section Length (FT)","Total Str. Section Weight (LBS)","Total Str. Section Cost (USD)","Total Fabrication Cost (USD)","Total Logistic Cost (USD)","Total Erection Cost (USD)","SUM TOTAL COST/SECTION",null,null,null,null,null,null,"Total Quantity of Supports","Total Weight of Supports (LB)","Total Cost of Supports (USD)","Total Design Time (HOURS)","Total Support Instal Time (HOURS)",null,"TOUGHLink Quantity (PAIRS)","TOUGHLink Hardware Quantity (PCS)","Hold Down Clamp Quantity (PR)","Clamp Hardware Quantity (PCS)","Expansion Guides Quantity (PR)","Guides Hardware Quantity (PCS)",null,"Hold Down Clamps Cost/Pair (USD)","Exp. Guides Cost/Pair (USD)","Total Accessory Cost (USD)",null,"TOUGHLink Time/Pair (HRS)","Hold Down Clamp Time/Pair (HRS)","Exp. Guide Time/Pair (HRS)","Total Time (HOURS)","Total Time Cost (USD)",null,"Cover Quantity (PCS)","Clamp Quantity (PCS)","TOUGHTorx Quantity (PCS)","Cover Weight (LBS)","TOUGHTorx Weight (LBS)","Clamps Cost (USD)","Installation Time (HOURS)"]
[null,{"$f":"ProjectData!C24","v":0},null,6,1,1,{"$f":"(E17*F17)*B17","v":0},{"$f":"G17*G11","v":0},{"$f":"G17*G13","v":0},{"$f":"H17*'CTI Input Sheet'!B28","v":0},{"$f":"H17*'CTI Input Sheet'!C28","v":0},{"$f":"H17*'CTI Input Sheet'!D28","v":0},{"$f":"SUM(I17:L17)","v":0},null,null,null,null,null,null,{"$f":"B17*E17","v":0},{"$f":"H17","v":0},{"$f":"M17","v":0},{"$f":"T17*'CTI Input Sheet'!K20","v":0},{"$f":"SUM(T17*H11)/60","v":0},null,0,{"$f":"B17*8","v":0},{"$f":"EVEN(B17*0.3333)*(E17)","v":0},{"$f":"AB17*4","v":0},{"$f":"EVEN(B17*0.7777)*(E17)","v":0},{"$f":"AD17*4","v":0},null,{"$f":"SUM(AB17*AH8)+(AC17*AH9)","v":0},{"$f":"SUM(AD17*AH10)+(AE17*AH11)","v":0},{"$f":"SUM(AG17:AH17)","v":0},null,{"$f":"B17*AO6/60","v":0},{"$f":"AB17*AO8/60","v":0},{"$f":"AD17*AO9/60","v":0},{"$f":"SUM(AK17:AM17)","v":0},{"$f":"AN17*AL6","v":0},null,{"$f":"IF(ProjectData!H$17=\"Not Required\",0,B17*2)","v":0},{"$f":"AQ17*0","v":0},{"$f":"AQ17*8","v":0},{"$f":"AQ17*2.16","v":0},{"$f":"AS17*AW6","v":0},{"$f":"AS17*AT6","v":0},{"$f":"AS17*AU6/60","v":0}]
[null,{"$f":"ProjectData!C25","v":0},null,9,1,1.25,0,{"$f":"G18*G11","v":0},{"$f":"G18*G13","v":0},{"$f":"H18*'CTI Input Sheet'!B28","v":0},{"$f":"H18*'CTI Input Sheet'!C28","v":0},{"$f":"H18*'CTI Input Sheet'!D28","v":0},{"$f":"SUM(I18:L18)","v":0},null,null,null,null,null,null,{"$f":"B18*E18","v":0},{"$f":"H18","v":0},{"$f":"M18","v":0},{"$f":"T18*'CTI Input Sheet'!K20","v":0},{"$f":"SUM(T18*H11)/60","v":0},null,0,{"$f":"B18*8","v":0},0,{"$f":"AB18*4","v":0},{"$f":"EVEN(B18*0.7777)*(E18)","v":0},{"$f":"AD18*4","v":0},null,{"$f":"SUM(AB18*AH8)+(AC18*AH9)","v":0},{"$f":"SUM(AD18*AH10)+(AE18*AH11)","v":0},0,null,{"$f":"B18*AO6/60","v":0},{"$f":"AB18*AO8/60","v":0},{"$f":"AD18*AO9/60","v":0},0,{"$f":"AN18*AL6","v":0},null,{"$f":"IF(ProjectData!H$17=\"Not Required\",0,B18*2)","v":0},{"$f":"AQ18*0","v":0},0,{"$f":"AQ18*3.03","v":0},0,{"$f":"AS18*AT7","v":0},0]
[null,{"$f":"ProjectData!C26","v":0},null,12,1,1.5,0,{"$f":"G19*G11","v":0},{"$f":"G19*G13","v":0},{"$f":"H19*'CTI Input Sheet'!B28","v":0},{"$f":"H19*'CTI Input Sheet'!C28","v":0},{"$f":"H19*'CTI Input Sheet'!D28","v":0},0,null,null,null,null,null,null,0,0,0,{"$f":"T19*'CTI Input Sheet'!K20","v":0},{"$f":"SUM(T19*H11)/60","v":0},null,0,0,0,0,0,0,null,{"$f":"SUM(AB19*AH8)+(AC19*AH9)","v":0},{"$f":"SUM(AD19*AH10)+(AE19*AH11)","v":0},0,null,{"$f":"B19*AO6/60","v":0},{"$f":"AB19*AO8/60","v":0},{"$f":"AD19*AO9/60","v":0},0,{"$f":"AN19*AL6","v":0},null,{"$f":"IF(ProjectData!H$17=\"Not Required\",0,B19*2)","v":0},0,0,{"$f":"AQ19*3.91","v":0},0,0,0]
[null,{"$f":"ProjectData!C27","v":0},null,18,1,2,0,{"$f":"G20*G11","v":0},{"$f":"G20*G13","v":0},{"$f":"H20*'CTI Input Sheet'!B28","v":0},{"$f":"H20*'CTI Input Sheet'!C28","v":0},{"$f":"H20*'CTI Input Sheet'!D28","v":0},0,null,null,null,null,null,null,0,0,0,{"$f":"T20*'CTI Input Sheet'!K20","v":0},{"$f":"SUM(T20*H11)/60","v":0},null,0,0,0,0,0,0,null,{"$f":"SUM(AB20*AH8)+(AC20*AH9)","v":0},{"$f":"SUM(AD20*AH10)+(AE20*AH11)","v":0},0,null,{"$f":"B20*AO6/60","v":0},{"$f":"AB20*AO8/60","v":0},{"$f":"AD20*AO9/60","v":0},0,{"$f":"AN20*AL6","v":0},null,{"$f":"IF(ProjectData!H$17=\"Not Required\",0,B20*2)","v":0},0,0,{"$f":"AQ20*5.67","v":0},0,0,0]
[null,{"$f":"ProjectData!C28","v":0},null,24,1,2.5,0,{"$f":"G21*G11","v":0},{"$f":"G21*G13","v":0},{"$f":"H21*'CTI Input Sheet'!B28","v":0},{"$f":"H21*'CTI Input Sheet'!C28","v":0},{"$f":"H21*'CTI Input Sheet'!D28","v":0},0,null,null,null,null,null,null,0,0,0,{"$f":"T21*'CTI Input Sheet'!K20","v":0},{"$f":"SUM(T21*H11)/60","v":0},null,0,0,0,0,0,0,null,{"$f":"SUM(AB21*AH8)+(AC21*AH9)","v":0},{"$f":"SUM(AD21*AH10)+(AE21*AH11)","v":0},{"$f":"SUM(AG21:AH21)","v":0},null,{"$f":"B21*AO6/60","v":0},{"$f":"AB21*AO8/60","v":0},{"$f":"AD21*AO9/60","v":0},0,{"$f":"AN21*AL6","v":0},null,{"$f":"IF(ProjectData!H$17=\"Not Required\",0,B21*2)","v":0},0,0,{"$f":"AQ21*7.42","v":0},0,0,0]
[null,{"$f":"ProjectData!C29","v":0},null,30,1,3,0,{"$f":"G22*G11","v":0},{"$f":"G22*G13","v":0},{"$f":"H22*'CTI Input Sheet'!B28","v":0},{"$f":"H22*'CTI Input Sheet'!C28","v":0},{"$f":"H22*'CTI Input Sheet'!D28","v":0},0,null,null,null,null,null,null,0,0,0,{"$f":"T22*'CTI Input Sheet'!K20","v":0},{"$f":"SUM(T22*H11)/60","v":0},null,0,0,0,0,0,0,null,{"$f":"SUM(AB22*AH8)+(AC22*AH9)","v":0},{"$f":"SUM(AD22*AH10)+(AE22*AH11)","v":0},0,null,{"$f":"B22*AO6/60","v":0},{"$f":"AB22*AO8/60","v":0},{"$f":"AD22*AO9/60","v":0},0,{"$f":"AN22*AL6","v":0},null,{"$f":"IF(ProjectData!H$17=\"Not Required\",0,B22*2)","v":0},0,0,{"$f":"AQ22*9.18","v":0},0,0,0]
[null,{"$f":"ProjectData!C30","v":0},null,36,1,3.5,0,{"$f":"G23*G11","v":0},{"$f":"G23*G13","v":0},{"$f":"H23*'CTI Input Sheet'!B28","v":0},{"$f":"H23*'CTI Input Sheet'!C28","v":0},{"$f":"H23*'CTI Input Sheet'!D28","v":0},0,null,null,null,null,null,null,0,0,0,{"$f":"T23*'CTI Input Sheet'!K20","v":0},{"$f":"SUM(T23*H11)/60","v":0},null,0,0,0,0,0,0,null,{"$f":"SUM(AB23*AH8)+(AC23*AH9)","v":0},{"$f":"SUM(AD23*AH10)+(AE23*AH11)","v":0},0,null,{"$f":"B23*AO6/60","v":0},{"$f":"AB23*AO8/60","v":0},{"$f":"AD23*AO9/60","v":0},0,{"$f":"AN23*AL6","v":0},null,{"$f":"IF(ProjectData!H$17=\"Not Required\",0,B23*2)","v":0},0,0,{"$f":"AQ23*10.94","v":0},0,0,0]
[null,{"$f":"SUM(B17:B23)","v":0},null,null,null,null,{"$f":"SUM(G17:G23)","v":0},0,0,0,0,0,0,null,null,null,null,null,null,{"$f":"SUM(T17:T23)","v":0},{"$f":"SUM(U17:U23)","v":0},{"$f":"SUM(V17:V23)","v":0},{"$f":"SUM(W17:W23)","v":0},{"$f":"SUM(X17:X23)","v":0},null,{"$f":"SUM(Z17:Z23)","v":0},0,0,0,0,0,null,{"$f":"SUM(AG17:AG23)","v":0},{"$f":"SUM(AH17:AH23)","v":0},{"$f":"SUM(AI17:AI23)","v":0},null,{"$f":"SUM(AK17:AK23)","v":0},{"$f":"SUM(AL17:AL23)","v":0},{"$f":"SUM(AM17:AM23)","v":0},{"$f":"SUM(AN17:AN23)","v":0},{"$f":"SUM(AO17:AO23)","v":0},null,{"$f":"SUM(AQ17:AQ23)","v":0},0,0,0,0,0,0]
[null,null,null,null,null,null,null,null,null,null,null,null,null,null,null,null,null,null,null,null,null,null,{"$f":"W24*'CTI Input Sheet'!H7","v":0},{"$f":"X24*'CTI Input Sheet'!H6","v":0},null,null,{"$f":"AA24*AH12","v":0},{"$f":"AB24*AH8","v":0},{"$f":"AC24*AH9","v":0},{"$f":"AD24*AH10","v":0},{"$f":"AE24*AH11","v":0},null,null,null,null,null,{"$f":"AK24*AL6","v":0},{"$f":"AL24*AL6","v":0},{"$f":"AM24*AL6","v":0}]
[null,"6in Straight Sections",null,"TSS : 6in Height Straight Section Support Quantity - Support Weight - Support Steel Fabrication, Logistics, Erection Costs",null,null,null,null,null,null,null,null,null,null,null,null,null,null,null,"6\" Straight Section : Support Structure Summary",null,null,null,null,null,"6\" Straight Section : Tray Accessory Quantities ",null,null,null,null,null,null,"6\" Straight Section : Tray Accessory Costs ",null,null,null,"6\" Straight Section : Tray Accessory Installation Time & Installation Cost",null,null,null,null,null,"6\" Straight Section : Covers"]
[null,"Quantities/Piece",null,"Tray Width (in)","Support Quantity","Section Length (FT)","Total Str. Section Length (FT)","Total Str. Section Weight (LBS)","Total Str. Section Cost (USD)","Total Fabrication Cost (USD)","Total Logistic Cost (USD)","Total Erection Cost (USD)","SUM TOTAL COST/SECTION",null,null,null,null,null,null,"Total Quantity of Supports","Total Weight of Supports (LB)","Total Cost of Supports (USD)","Total Design Time (HOURS)","Total Support Instal Time (HOURS)",null,"TOUGHLink Quantity (PAIRS)","TOUGHLink Hardware Quantity (PCS)","Hold Down Clamp Quantity (PR)","Clamp Hardware Quantity (PCS)","Expansion Guides Quantity (PR)","Guides Hardware Quantity (PCS)",null,"Hold Down Clamps Cost/Pair (USD)","Exp. Guides Cost/Pair (USD)","Total Accessory Cost (USD)",null,"TOUGHLink Time/Pair (HRS)","Hold Down Clamp Time/Pair (HRS)","Exp. Guide Time/Pair (HRS)","Total Time (HOURS)","Total Time Cost (USD)",null,"Cover Quantity (PCS)","Clamp Quantity (PCS)","TOUGHTorx Quantity (PCS)","Cover Weight (LBS)","TOUGHTorx Weight (LBS)","Clamps Cost (USD)","Installation Time (HOURS)"]
[null,{"$f":"ProjectData!F24","v":0},null,6,1,1,{"$f":"(E28*F28)*B28","v":0},{"$f":"G28*G11","v":0},{"$f":"G28*G13","v":0},{"$f":"H28*'CTI Input Sheet'!B28","v":0},{"$f":"H28*'CTI Input Sheet'!C28","v":0},{"$f":"H28*'CTI Input Sheet'!D28","v":0},{"$f":"SUM(I28:L28)","v":0},null,null,null,null,null,null,{"$f":"B28*E28","v":0},{"$f":"H28","v":0},{"$f":"M28","v":0},{"$f":"T28*'CTI Input Sheet'!K20","v":0},{"$f":"SUM(T28*H11)/60","v":0},null,0,{"$f":"B28*8","v":0},{"$f":"EVEN(B28*0.3333)*(E28)","v":0},{"$f":"AB28*4","v":0},{"$f":"EVEN(B28*0.7777)*(E28)","v":0},{"$f":"AD28*4","v":0},null,{"$f":"SUM(AB28*AH8)+(AC28*AH9)","v":0},{"$f":"SUM(AD28*AH10)+(AE28*AH11)","v":0},{"$f":"SUM(AG28:AH28)","v":0},null,{"$f":"B28*AO6/60","v":0},{"$f":"AB28*AO8/60","v":0},{"$f":"AD28*AO9/60","v":0},{"$f":"SUM(AK28:AM28)","v":0},{"$f":"AN28*AL6","v":0},null,{"$f":"IF(ProjectData!H$17=\"Not Required\",0,B28*2)","v":0},{"$f":"AQ28*0","v":0},{"$f":"AQ28*8","v":0},{"$f":"AQ28*2.16","v":0},{"$f":"AS28*AW6","v":0},{"$f":"AS28*AT6","v":0},{"$f":"AS28*AU6/60","v":0}]
[null,{"$f":"ProjectData!F25","v":0},null,9,1,1.25,0,{"$f":"G29*G11","v":0},{"$f":"G29*G13","v":0},{"$f":"H29*'CTI Input Sheet'!B28","v":0},{"$f":"H29*'CTI Input Sheet'!C28","v":0},{"$f":"H29*'CTI Input Sheet'!D28","v":0},0,null,null,null,null,null,null,{"$f":"B29*E29","v":0},{"$f":"H29","v":0},0,{"$f":"T29*'CTI Input Sheet'!K20","v":0},{"$f":"SUM(T29*H11)/60","v":0},null,0,0,0,{"$f":"AB29*4","v":0},0,{"$f":"AD29*4","v":0},null,{"$f":"SUM(AB29*AH8)+(AC29*AH9)","v":0},{"$f":"SUM(AD29*AH10)+(AE29*AH11)","v":0},0,null,{"$f":"B29*AO6/60","v":0},{"$f":"AB29*AO8/60","v":0},{"$f":"AD29*AO9/60","v":0},0,{"$f":"AN29*AL6","v":0},null,{"$f":"IF(ProjectData!H$17=\"Not Required\",0,B29*2)","v":0},0,0,{"$f":"AQ29*3.03","v":0},{"$f":"AS29*AW7","v":0},{"$f":"AS29*AT7","v":0},0]
[null,{"$f":"ProjectData!F26","v":30},null,12,1,1.5,45,{"$f":"G30*G11","v":171},{"$f":"G30*G13","v":1026},{"$f":"H30*'CTI Input Sheet'!B28","v":256.5},{"$f":"H30*'CTI Input Sheet'!C28","v":42.75},{"$f":"H30*'CTI Input Sheet'!D28","v":0},1325.25,null,null,null,null,null,null,30,171,1325.25,{"$f":"T30*'CTI Input Sheet'!K20","v":7.5},{"$f":"SUM(T30*H11)/60","v":7.5},null,0,240,10,40,24,96,null,{"$f":"SUM(AB30*AH8)+(AC30*AH9)","v":110},{"$f":"SUM(AD30*AH10)+(AE30*AH11)","v":264},374,null,{"$f":"B30*AO6/60","v":0.5},{"$f":"AB30*AO8/60","v":0.33333333333333331},{"$f":"AD30*AO9/60","v":0.8},1.6333333333333333,{"$f":"AN30*AL6","v":122.5},null,{"$f":"IF(ProjectData!H$17=\"Not Required\",0,B30*2)","v":0},0,0,{"$f":"AQ30*3.91","v":0},0,0,0]
[null,{"$f":"ProjectData!F27","v":0},null,18,1,2,0,{"$f":"G31*G11","v":0},{"$f":"G31*G13","v":0},{"$f":"H31*'CTI Input Sheet'!B28","v":0},{"$f":"H31*'CTI Input Sheet'!C28","v":0},{"$f":"H31*'CTI Input Sheet'!D28","v":0},0,null,null,null,null,null,null,0,0,0,{"$f":"T31*'CTI Input Sheet'!K20","v":0},{"$f":"SUM(T31*H11)/60","v":0},null,0,0,0,0,0,0,null,{"$f":"SUM(AB31*AH8)+(AC31*AH9)","v":0},{"$f":"SUM(AD31*AH10)+(AE31*AH11)","v":0},0,null,{"$f":"B31*AO6/60","v":0},{"$f":"AB31*AO8/60","v":0},{"$f":"AD31*AO9/60","v":0},0,{"$f":"AN31*AL6","v":0},null,{"$f":"IF(ProjectData!H$17=\"Not Required\",0,B31*2)","v":0},0,0,{"$f":"AQ31*5.67","v":0},0,0,0]
[null,{"$f":"ProjectData!F28","v":0},null,24,1,2.5,0,{"$f":"G32*G11","v":0},{"$f":"G32*G13","v":0},{"$f":"H32*'CTI Input Sheet'!B28","v":0},{"$f":"H32*'CTI Input Sheet'!C28","v":0},{"$f":"H32*'CTI Input Sheet'!D28","v":0},0,null,null,null,null,null,null,0,0,0,{"$f":"T32*'CTI Input Sheet'!K20","v":0},{"$f":"SUM(T32*H11)/60","v":0},null,0,0,0,0,0,0,null,{"$f":"SUM(AB32*AH8)+(AC32*AH9)","v":0},{"$f":"SUM(AD32*AH10)+(AE32*AH11)","v":0},0,null,{"$f":"B32*AO6/60","v":0},{"$f":"AB32*AO8/60","v":0},{"$f":"AD32*AO9/60","v":0},0,{"$f":"AN32*AL6","v":0},null,{"$f":"IF(ProjectData!H$17=\"Not Required\",0,B32*2)","v":0},0,0,{"$f":"AQ32*7.42","v":0},0,0,0]
[null,{"$f":"ProjectData!F29","v":0},null,30,1,3,0,{"$f":"G33*G11","v":0},{"$f":"G33*G13","v":0},{"$f":"H33*'CTI Input Sheet'!B28","v":0},{"$f":"H33*'CTI Input Sheet'!C28","v":0},{"$f":"H33*'CTI Input Sheet'!D28","v":0},0,null,null,null,null,null,null,0,0,0,{"$f":"T33*'CTI Input Sheet'!K20","v":0},{"$f":"SUM(T33*H11)/60","v":0},null,0,0,0,0,0,0,null,{"$f":"SUM(AB33*AH8)+(AC33*AH9)","v":0},{"$f":"SUM(AD33*AH10)+(AE33*AH11)","v":0},0,null,{"$f":"B33*AO6/60","v":0},{"$f":"AB33*AO8/60","v":0},{"$f":"AD33*AO9/60","v":0},0,{"$f":"AN33*AL6","v":0},null,{"$f":"IF(ProjectData!H$17=\"Not Required\",0,B33*2)","v":0},0,0,{"$f":"AQ33*9.18","v":0},0,0,0]
[null,{"$f":"ProjectData!F30","v":15},null,36,1,3.5,52.5,{"$f":"G34*G11","v":199.5},{"$f":"G34*G13","v":1197},{"$f":"H34*'CTI Input Sheet'!B28","v":299.25},{"$f":"H34*'CTI Input Sheet'!C28","v":49.875},{"$f":"H34*'CTI Input Sheet'!D28","v":0},1546.125,null,null,null,null,null,null,15,199.5,1546.125,{"$f":"T34*'CTI Input Sheet'!K20","v":3.75},{"$f":"SUM(T34*H11)/60","v":3.75},null,0,120,6,24,12,48,null,{"$f":"SUM(AB34*AH8)+(AC34*AH9)","v":66},{"$f":"SUM(AD34*AH10)+(AE34*AH11)","v":132},198,null,{"$f":"B34*AO6/60","v":0.25},{"$f":"AB34*AO8/60","v":0.2},{"$f":"AD34*AO9/60","v":0.4},0.85000000000000009,{"$f":"AN34*AL6","v":63.750000000000007},null,{"$f":"IF(ProjectData!H$17=\"Not Required\",0,B34*2)","v":0},0,0,{"$f":"AQ34*10.94","v":0},0,0,0]
[null,{"$f":"SUM(B28:B34)","v":45},null,null,null,null,{"$f":"SUM(G28:G34)","v":97.5},{"$f":"SUM(H28:H34)","v":370.5},2223,555.75,92.625,0,2871.375,null,null,null,null,null,null,{"$f":"SUM(T28:T34)","v":45},{"$f":"SUM(U28:U34)","v":370.5},{"$f":"SUM(V28:V34)","v":2871.375},{"$f":"SUM(W28:W34)","v":11.25},{"$f":"SUM(X28:X34)","v":11.25},null,{"$f":"SUM(Z28:Z34)","v":0},360,16,64,{"$f":"SUM(AD28:AD34)","v":36},144,null,{"$f":"SUM(AG28:AG34)","v":176},{"$f":"SUM(AH28:AH34)","v":396},{"$f":"SUM(AI28:AI34)","v":572},null,{"$f":"SUM(AK28:AK34)","v":0.75},{"$f":"SUM(AL28:AL34)","v":0.53333333333333333},{"$f":"SUM(AM28:AM34)","v":1.2000000000000002},{"$f":"SUM(AN28:AN34)","v":2.4833333333333334},{"$f":"SUM(AO28:AO34)","v":186.25},null,{"$f":"SUM(AQ28:AQ34)","v":0},0,0,0,0,0,0]
[null,null,null,null,null,null,null,null,null,null,null,null,null,null,null,null,null,null,null,null,null,null,{"$f":"W35*'CTI Input Sheet'!H7","v":843.75},{"$f":"X35*'CTI Input Sheet'!H6","v":843.75},null,null,{"$f":"AA35*AH12","v":540},{"$f":"AB35*AH8","v":96},{"$f":"AC35*AH9","v":80},{"$f":"AD35*AH10","v":216},{"$f":"AE35*AH11","v":180},null,null,null,null,null,{"$f":"AK35*AL6","v":56.25},{"$f":"AL35*AL6","v":40},{"$f":"AM35*AL6","v":90.000000000000014}]
[null,"HB Fittings",null,"HB Fittings",null,"TSS : HB Support Quantity - Support Weight - Support Steel Fabrication, Logistics, Erection Costs",null,null,null,null,null,null,null,null,null,null,null,null,null,"HB : Support Structure Summary",null,null,null,null,null,"HB : Tray Accessory Quantities ",null,null,null,null,null,null,"HB : Tray Accessory Costs ",null,null,null,"HB : Tray Accessory Installation Time & Installation Cost",null,null,null,null,null,"HB Covers"]
[null,"Quantities/Piece",null,"HB Width (in)","HB Radius (in) ","Support Quantity","OS1 Str. Section Length (FT)","OS2 Str. Section Length (FT)","CTR Str. Section Length (FT)","Total Str. Section Length (FT)","Total Str. Section Weight (LBS)","Total Str. Section Cost (USD)","Total Fabrication Cost (USD)","Total Logistic Cost (USD)","Total Erection Cost (USD)","SUM TOTAL COST/FITTING",null,null,null,"Total Quantity of Supports","Total Weight of Supports (LB)","Total Cost of Supports (USD)","Total Design Time (HOURS)","Total Support Instal Time (HOURS)",null,"Integral Link Quantity (PAIRS)","Integral ink Hardware Quantity (PCS)","Hold Down Clamp Quantity (PR)","Clamp Hardware Quantity (PCS)","Expansion Guides Quantity (PR)","Guides Hardware Quantity (PCS)",null,"Hold Down Clamps Cost/Pair (USD)","Exp. Guides Cost/Pair (USD)","Total Accessory Cost (USD)",null,"TOUGHLink Time/Pair (HRS)","Hold Down Clamp Time/Pair (HRS)","Exp. Guide Time/Pair (HRS)","Total Time (HOURS)","Total Time Cost (USD)",null,"Cover Quantity (PCS)","Clamp Quantity (PCS)","TOUGHTorx Quantity (PCS)","Cover Weight (LBS)","TOUGHTorx Weight (LBS)","Clamps Cost (USD)","Installation Time (HOURS)"]
[null,{"$f":"ProjectData!D37","v":0},null,6,12,2,1,2,0,{"$f":"SUM(G39+H39+I39)*B39","v":0},{"$f":"J39*G11","v":0},{"$f":"J39*G13","v":0},{"$f":"K39*'CTI Input Sheet'!B28","v":0},{"$f":"K39*'CTI Input Sheet'!C28","v":0},{"$f":"K39*'CTI Input Sheet'!D28","v":0},{"$f":"SUM(L39:O39)","v":0},null,null,null,{"$f":"B39*F39","v":0},{"$f":"K39","v":0},{"$f":"P39","v":0},{"$f":"T39*'CTI Input Sheet'!K21","v":0},{"$f":"SUM(T39*H11)/60","v":0},null,0,{"$f":"Z39*8","v":0},{"$f":"(F39)*B39","v":0},{"$f":"AB39*4","v":0},0,0,null,{"$f":"SUM(AB39*AH8)+(AC39*AH9)","v":0},{"$f":"SUM(AD39*AH10)+(AD39*AH11)","v":0},{"$f":"SUM(AG39:AH39)","v":0},null,{"$f":"(B39*2)*AO6/60","v":0},{"$f":"AB39*AO8/60","v":0},{"$f":"AD39*AO9","v":0},{"$f":"SUM(AK39:AM39)","v":0},{"$f":"AN39*AL6","v":0},null,{"$f":"IF(ProjectData!H$17=\"Not Required\",0,B39*2)","v":0},{"$f":"AQ39*0","v":0},{"$f":"AQ39*6","v":0},{"$f":"AQ39*0.42","v":0},{"$f":"AS39*AV6","v":0},{"$f":"AS39*AR6","v":0},{"$f":"AS39*AS6/60","v":0}]
[null,{"$f":"ProjectData!D38","v":0},null,6,24,2,1,3,0,0,{"$f":"J40*G11","v":0},{"$f":"J40*G13","v":0},{"$f":"K40*'CTI Input Sheet'!B28","v":0},{"$f":"K40*'CTI Input Sheet'!C28","v":0},{"$f":"K40*'CTI Input Sheet'!D28","v":0},0,null,null,null,{"$f":"B40*F40","v":0},0,0,{"$f":"T40*'CTI Input Sheet'!K21","v":0},{"$f":"SUM(T40*H11)/60","v":0},null,0,0,0,0,0,0,null,{"$f":"SUM(AB40*AH8)+(AC40*AH9)","v":0},{"$f":"SUM(AD40*AH10)+(AD40*AH11)","v":0},0,null,{"$f":"(B40*2)*AO6/60","v":0},{"$f":"AB40*AO8/60","v":0},{"$f":"AD40*AO9","v":0},0,{"$f":"AN40*AL6","v":0},null,{"$f":"IF(ProjectData!H$17=\"Not Required\",0,B40*2)","v":0},0,0,{"$f":"AQ40*0.76","v":0},{"$f":"AS40*AV6","v":0},{"$f":"AS40*AR6","v":0},{"$f":"AS40*AS6/60","v":0}]
[null,{"$f":"ProjectData!D39","v":0},null,6,36,2,1,4,0,0,{"$f":"J41*G11","v":0},{"$f":"J41*G13","v":0},{"$f":"K41*'CTI Input Sheet'!B28","v":0},{"$f":"K41*'CTI Input Sheet'!C28","v":0},{"$f":"K41*'CTI Input Sheet'!D28","v":0},0,null,null,null,0,0,0,{"$f":"T41*'CTI Input Sheet'!K21","v":0},{"$f":"SUM(T41*H11)/60","v":0},null,0,0,0,0,0,0,null,{"$f":"SUM(AB41*AH8)+(AC41*AH9)","v":0},{"$f":"SUM(AD41*AH10)+(AD41*AH11)","v":0},0,null,{"$f":"(B41*2)*AO6/60","v":0},{"$f":"AB41*AO8/60","v":0},{"$f":"AD41*AO9","v":0},0,{"$f":"AN41*AL6","v":0},null,{"$f":"IF(ProjectData!H$17=\"Not Required\",0,B41*2)","v":0},0,0,{"$f":"AQ41*1.1","v":0},{"$f":"AS41*AV6","v":0},{"$f":"AS41*AR6","v":0},{"$f":"AS41*AS6/60","v":0}]
[null,{"$f":"ProjectData!D40","v":0},null,9,12,2,1.25,2.25,0,0,{"$f":"J42*G11","v":0},{"$f":"J42*G13","v":0},{"$f":"K42*'CTI Input Sheet'!B28","v":0},{"$f":"K42*'CTI Input Sheet'!C28","v":0},{"$f":"K42*'CTI Input Sheet'!D28","v":0},0,null,null,null,0,0,0,{"$f":"T42*'CTI Input Sheet'!K21","v":0},{"$f":"SUM(T42*H11)/60","v":0},null,0,0,0,0,0,0,null,{"$f":"SUM(AB42*AH8)+(AC42*AH9)","v":0},{"$f":"SUM(AD42*AH10)+(AD42*AH11)","v":0},0,null,{"$f":"(B42*2)*AO6/60","v":0},{"$f":"AB42*AO8/60","v":0},{"$f":"AD42*AO9","v":0},0,{"$f":"AN42*AL6","v":0},null,{"$f":"IF(ProjectData!H$17=\"Not Required\",0,B42*2)","v":0},0,0,{"$f":"AQ42*0.65","v":0},{"$f":"AS42*AV7","v":0},{"$f":"AS42*AR7","v":0},{"$f":"AS42*AS7/60","v":0}]
[null,{"$f":"ProjectData!D41","v":0},null,9,24,2,1.25,3.25,0,0,{"$f":"J43*G11","v":0},{"$f":"J43*G13","v":0},{"$f":"K43*'CTI Input Sheet'!B28","v":0},{"$f":"K43*'CTI Input Sheet'!C28","v":0},{"$f":"K43*'CTI Input Sheet'!D28","v":0},0,null,null,null,0,0,0,{"$f":"T43*'CTI Input Sheet'!K21","v":0},{"$f":"SUM(T43*H11)/60","v":0},null,0,0,0,0,0,0,null,{"$f":"SUM(AB43*AH8)+(AC43*AH9)","v":0},{"$f":"SUM(AD43*AH10)+(AD43*AH11)","v":0},0,null,{"$f":"(B43*2)*AO6/60","v":0},{"$f":"AB43*AO8/60","v":0},{"$f":"AD43*AO9","v":0},0,{"$f":"AN43*AL6","v":0},null,{"$f":"IF(ProjectData!H$17=\"Not Required\",0,B43*2)","v":0},0,0,{"$f":"AQ43*1.13","v":0},{"$f":"AS43*AV7","v":0},{"$f":"AS43*AR7","v":0},{"$f":"AS43*AS7/60","v":0}]
[null,{"$f":"ProjectData!D42","v":0},null,9,36,2,1.25,4.25,0,0,{"$f":"J44*G11","v":0},{"$f":"J44*G13","v":0},{"$f":"K44*'CTI Input Sheet'!B28","v":0},{"$f":"K44*'CTI Input Sheet'!C28","v":0},{"$f":"K44*'CTI Input Sheet'!D28","v":0},0,null,null,null,0,0,0,{"$f":"T44*'CTI Input Sheet'!K21","v":0},{"$f":"SUM(T44*H11)/60","v":0},null,0,0,0,0,0,0,null,{"$f":"SUM(AB44*AH8)+(AC44*AH9)","v":0},{"$f":"SUM(AD44*AH10)+(AD44*AH11)","v":0},0,null,{"$f":"(B44*2)*AO6/60","v":0},{"$f":"AB44*AO8/60","v":0},{"$f":"AD44*AO9","v":0},0,{"$f":"AN44*AL6","v":0},null,{"$f":"IF(ProjectData!H$17=\"Not Required\",0,B44*2)","v":0},0,0,{"$f":"AQ44*1.61","v":0},{"$f":"AS44*AV7","v":0},{"$f":"AS44*AR7","v":0},{"$f":"AS44*AS7/60","v":0}]
[null,{"$f":"ProjectData!D43","v":3},null,12,12,2,1.5,2.5,0,12,{"$f":"J45*G11","v":45.599999999999994},{"$f":"J45*G13","v":273.60000000000002},{"$f":"K45*'CTI Input Sheet'!B28","v":68.399999999999991},{"$f":"K45*'CTI Input Sheet'!C28","v":11.399999999999999},{"$f":"K45*'CTI Input Sheet'!D28","v":0},353.4,null,null,null,6,45.599999999999994,353.4,{"$f":"T45*'CTI Input Sheet'!K21","v":9},{"$f":"SUM(T45*H11)/60","v":1.5},null,0,0,6,24,0,0,null,{"$f":"SUM(AB45*AH8)+(AC45*AH9)","v":66},{"$f":"SUM(AD45*AH10)+(AD45*AH11)","v":0},66,null,{"$f":"(B45*2)*AO6/60","v":0.1},{"$f":"AB45*AO8/60","v":0.2},{"$f":"AD45*AO9","v":0},0.30000000000000004,{"$f":"AN45*AL6","v":22.500000000000004},null,{"$f":"IF(ProjectData!H$17=\"Not Required\",0,B45*2)","v":0},0,0,{"$f":"AQ45*0.92","v":0},{"$f":"AS45*AV8","v":0},{"$f":"AS45*AR8","v":0},{"$f":"AS45*AS8/60","v":0}]
[null,{"$f":"ProjectData!D44","v":0},null,12,24,2,1.5,3.5,0,0,{"$f":"J46*G11","v":0},{"$f":"J46*G13","v":0},{"$f":"K46*'CTI Input Sheet'!B28","v":0},{"$f":"K46*'CTI Input Sheet'!C28","v":0},{"$f":"K46*'CTI Input Sheet'!D28","v":0},0,null,null,null,0,0,0,{"$f":"T46*'CTI Input Sheet'!K21","v":0},{"$f":"SUM(T46*H11)/60","v":0},null,0,0,0,0,0,0,null,{"$f":"SUM(AB46*AH8)+(AC46*AH9)","v":0},{"$f":"SUM(AD46*AH10)+(AD46*AH11)","v":0},0,null,{"$f":"(B46*2)*AO6/60","v":0},{"$f":"AB46*AO8/60","v":0},{"$f":"AD46*AO9","v":0},0,{"$f":"AN46*AL6","v":0},null,{"$f":"IF(ProjectData!H$17=\"Not Required\",0,B46*2)","v":0},0,0,{"$f":"AQ46*1.53","v":0},{"$f":"AS46*AV8","v":0},{"$f":"AS46*AR8","v":0},{"$f":"AS46*AS8/60","v":0}]
[null,{"$f":"ProjectData!D45","v":0},null,12,36,2,1.5,4.5,0,0,{"$f":"J47*G11","v":0},{"$f":"J47*G13","v":0},{"$f":"K47*'CTI Input Sheet'!B28","v":0},{"$f":"K47*'CTI Input Sheet'!C28","v":0},{"$f":"K47*'CTI Input Sheet'!D28","v":0},0,null,null,null,0,0,0,{"$f":"T47*'CTI Input Sheet'!K21","v":0},{"$f":"SUM(T47*H11)/60","v":0},null,0,0,0,0,0,0,null,{"$f":"SUM(AB47*AH8)+(AC47*AH9)","v":0},{"$f":"SUM(AD47*AH10)+(AD47*AH11)","v":0},0,null,{"$f":"(B47*2)*AO6/60","v":0},{"$f":"AB47*AO8/60","v":0},{"$f":"AD47*AO9","v":0},0,{"$f":"AN47*AL6","v":0},null,{"$f":"IF(ProjectData!H$17=\"Not Required\",0,B47*2)","v":0},0,0,{"$f":"AQ47*2.15","v":0},{"$f":"AS47*AV8","v":0},{"$f":"AS47*AR8","v":0},{"$f":"AS47*AS8/60","v":0}]
[null,{"$f":"ProjectData!D46","v":0},null,18,12,2,2,3,0,0,{"$f":"J48*G11","v":0},{"$f":"J48*G13","v":0},{"$f":"K48*'CTI Input Sheet'!B28","v":0},{"$f":"K48*'CTI Input Sheet'!C28","v":0},{"$f":"K48*'CTI Input Sheet'!D28","v":0},0,null,null,null,0,0,0,{"$f":"T48*'CTI Input Sheet'!K21","v":0},{"$f":"SUM(T48*H11)/60","v":0},null,0,0,0,0,0,0,null,{"$f":"SUM(AB48*AH8)+(AC48*AH9)","v":0},{"$f":"SUM(AD48*AH10)+(AD48*AH11)","v":0},0,null,{"$f":"(B48*2)*AO6/60","v":0},{"$f":"AB48*AO8/60","v":0},{"$f":"AD48*AO9","v":0},0,{"$f":"AN48*AL6","v":0},null,{"$f":"IF(ProjectData!H$17=\"Not Required\",0,B48*2)","v":0},0,0,{"$f":"AQ48*1.56","v":0},{"$f":"AS48*AV9","v":0},{"$f":"AS48*AR9","v":0},{"$f":"AS48*AS9/60","v":0}]
[null,{"$f":"ProjectData!D47","v":0},null,18,24,2,2,4,0,0,{"$f":"J49*G11","v":0},{"$f":"J49*G13","v":0},{"$f":"K49*'CTI Input Sheet'!B28","v":0},{"$f":"K49*'CTI Input Sheet'!C28","v":0},{"$f":"K49*'CTI Input Sheet'!D28","v":0},0,null,null,null,0,0,0,{"$f":"T49*'CTI Input Sheet'!K21","v":0},{"$f":"SUM(T49*H11)/60","v":0},null,0,0,0,0,0,0,null,{"$f":"SUM(AB49*AH8)+(AC49*AH9)","v":0},{"$f":"SUM(AD49*AH10)+(AD49*AH11)","v":0},0,null,{"$f":"(B49*2)*AO6/60","v":0},{"$f":"AB49*AO8/60","v":0},{"$f":"AD49*AO9","v":0},0,{"$f":"AN49*AL6","v":0},null,{"$f":"IF(ProjectData!H$17=\"Not Required\",0,B49*2)","v":0},0,0,{"$f":"AQ49*2.45","v":0},{"$f":"AS49*AV9","v":0},{"$f":"AS49*AR9","v":0},{"$f":"AS49*AS9/60","v":0}]
[null,{"$f":"ProjectData!D48","v":0},null,18,36,2,2,5,0,0,{"$f":"J50*G11","v":0},{"$f":"J50*G13","v":0},{"$f":"K50*'CTI Input Sheet'!B28","v":0},{"$f":"K50*'CTI Input Sheet'!C28","v":0},{"$f":"K50*'CTI Input Sheet'!D28","v":0},0,null,null,null,0,0,0,{"$f":"T50*'CTI Input Sheet'!K21","v":0},{"$f":"SUM(T50*H11)/60","v":0},null,0,0,0,0,0,0,null,{"$f":"SUM(AB50*AH8)+(AC50*AH9)","v":0},{"$f":"SUM(AD50*AH10)+(AD50*AH11)","v":0},0,null,{"$f":"(B50*2)*AO6/60","v":0},{"$f":"AB50*AO8/60","v":0},{"$f":"AD50*AO9","v":0},0,{"$f":"AN50*AL6","v":0},null,{"$f":"IF(ProjectData!H$17=\"Not Required\",0,B50*2)","v":0},0,0,{"$f":"AQ50*3.34","v":0},{"$f":"AS50*AV9","v":0},{"$f":"AS50*AR9","v":0},{"$f":"AS50*AS9/60","v":0}]
[null,{"$f":"ProjectData!D49","v":0},null,24,12,2,2.5,3.5,0,0,{"$f":"J51*G11","v":0},{"$f":"J51*G13","v":0},{"$f":"K51*'CTI Input Sheet'!B28","v":0},{"$f":"K51*'CTI Input Sheet'!C28","v":0},{"$f":"K51*'CTI Input Sheet'!D28","v":0},0,null,null,null,0,0,0,{"$f":"T51*'CTI Input Sheet'!K21","v":0},{"$f":"SUM(T51*H11)/60","v":0},null,0,0,0,0,0,0,null,{"$f":"SUM(AB51*AH8)+(AC51*AH9)","v":0},{"$f":"SUM(AD51*AH10)+(AD51*AH11)","v":0},0,null,{"$f":"(B51*2)*AO6/60","v":0},{"$f":"AB51*AO8/60","v":0},{"$f":"AD51*AO9","v":0},0,{"$f":"AN51*AL6","v":0},null,{"$f":"IF(ProjectData!H$17=\"Not Required\",0,B51*2)","v":0},0,0,{"$f":"AQ51*2.33","v":0},{"$f":"AS51*AV10","v":0},{"$f":"AS51*AR10","v":0},{"$f":"AS51*AS10/60","v":0}]
[null,{"$f":"ProjectData!D50","v":0},null,24,24,2,2.5,4.5,0,0,{"$f":"J52*G11","v":0},{"$f":"J52*G13","v":0},{"$f":"K52*'CTI Input Sheet'!B28","v":0},{"$f":"K52*'CTI Input Sheet'!C28","v":0},{"$f":"K52*'CTI Input Sheet'!D28","v":0},0,null,null,null,0,0,0,{"$f":"T52*'CTI Input Sheet'!K21","v":0},{"$f":"SUM(T52*H11)/60","v":0},null,0,0,0,0,0,0,null,{"$f":"SUM(AB52*AH8)+(AC52*AH9)","v":0},{"$f":"SUM(AD52*AH10)+(AD52*AH11)","v":0},0,null,{"$f":"(B52*2)*AO6/60","v":0},{"$f":"AB52*AO8/60","v":0},{"$f":"AD52*AO9","v":0},0,{"$f":"AN52*AL6","v":0},null,{"$f":"IF(ProjectData!H$17=\"Not Required\",0,B52*2)","v":0},0,0,{"$f":"AQ52*3.5","v":0},{"$f":"AS52*AV10","v":0},{"$f":"AS52*AR10","v":0},{"$f":"AS52*AS10/60","v":0}]
[null,{"$f":"ProjectData!D51","v":0},null,24,36,2,2.5,5.5,0,0,{"$f":"J53*G11","v":0},{"$f":"J53*G13","v":0},{"$f":"K53*'CTI Input Sheet'!B28","v":0},{"$f":"K53*'CTI Input Sheet'!C28","v":0},{"$f":"K53*'CTI Input Sheet'!D28","v":0},0,null,null,null,0,0,0,{"$f":"T53*'CTI Input Sheet'!K21","v":0},{"$f":"SUM(T53*H11)/60","v":0},null,0,0,0,0,0,0,null,{"$f":"SUM(AB53*AH8)+(AC53*AH9)","v":0},{"$f":"SUM(AD53*AH10)+(AD53*AH11)","v":0},0,null,{"$f":"(B53*2)*AO6/60","v":0},{"$f":"AB53*AO8/60","v":0},{"$f":"AD53*AO9","v":0},0,{"$f":"AN53*AL6","v":0},null,{"$f":"IF(ProjectData!H$17=\"Not Required\",0,B53*2)","v":0},0,0,{"$f":"AQ53*4.66","v":0},{"$f":"AS53*AV10","v":0},{"$f":"AS53*AR10","v":0},{"$f":"AS53*AS10/60","v":0}]
[null,{"$f":"ProjectData!D52","v":0},null,30,12,2,3,4,0,0,{"$f":"J54*G11","v":0},{"$f":"J54*G13","v":0},{"$f":"K54*'CTI Input Sheet'!B28","v":0},{"$f":"K54*'CTI Input Sheet'!C28","v":0},{"$f":"K54*'CTI Input Sheet'!D28","v":0},0,null,null,null,0,0,0,{"$f":"T54*'CTI Input Sheet'!K21","v":0},{"$f":"SUM(T54*H11)/60","v":0},null,0,0,0,0,0,0,null,{"$f":"SUM(AB54*AH8)+(AC54*AH9)","v":0},{"$f":"SUM(AD54*AH10)+(AD54*AH11)","v":0},0,null,{"$f":"(B54*2)*AO6/60","v":0},{"$f":"AB54*AO8/60","v":0},{"$f":"AD54*AO9","v":0},0,{"$f":"AN54*AL6","v":0},null,{"$f":"IF(ProjectData!H$17=\"Not Required\",0,B54*2)","v":0},0,0,{"$f":"AQ54*3.24","v":0},{"$f":"AS54*AV11","v":0},{"$f":"AS54*AR11","v":0},{"$f":"AS54*AS11/60","v":0}]
[null,{"$f":"ProjectData!D53","v":0},null,30,24,2,3,5,0,0,{"$f":"J55*G11","v":0},{"$f":"J55*G13","v":0},{"$f":"K55*'CTI Input Sheet'!B28","v":0},{"$f":"K55*'CTI Input Sheet'!C28","v":0},{"$f":"K55*'CTI Input Sheet'!D28","v":0},0,null,null,null,0,0,0,{"$f":"T55*'CTI Input Sheet'!K21","v":0},{"$f":"SUM(T55*H11)/60","v":0},null,0,0,0,0,0,0,null,{"$f":"SUM(AB55*AH8)+(AC55*AH9)","v":0},{"$f":"SUM(AD55*AH10)+(AD55*AH11)","v":0},0,null,{"$f":"(B55*2)*AO6/60","v":0},{"$f":"AB55*AO8/60","v":0},{"$f":"AD55*AO9","v":0},0,{"$f":"AN55*AL6","v":0},null,{"$f":"IF(ProjectData!H$17=\"Not Required\",0,B55*2)","v":0},0,0,{"$f":"AQ55*4.69","v":0},{"$f":"AS55*AV11","v":0},{"$f":"AS55*AR11","v":0},{"$f":"AS55*AS11/60","v":0}]
[null,{"$f":"ProjectData!D54","v":0},null,30,36,2,3,6,0,0,{"$f":"J56*G11","v":0},{"$f":"J56*G13","v":0},{"$f":"K56*'CTI Input Sheet'!B28","v":0},{"$f":"K56*'CTI Input Sheet'!C28","v":0},{"$f":"K56*'CTI Input Sheet'!D28","v":0},0,null,null,null,0,0,0,{"$f":"T56*'CTI Input Sheet'!K21","v":0},{"$f":"SUM(T56*H11)/60","v":0},null,0,0,0,0,0,0,null,{"$f":"SUM(AB56*AH8)+(AC56*AH9)","v":0},{"$f":"SUM(AD56*AH10)+(AD56*AH11)","v":0},0,null,{"$f":"(B56*2)*AO6/60","v":0},{"$f":"AB56*AO8/60","v":0},{"$f":"AD56*AO9","v":0},0,{"$f":"AN56*AL6","v":0},null,{"$f":"IF(ProjectData!H$17=\"Not Required\",0,B56*2)","v":0},0,0,{"$f":"AQ56*6.13","v":0},{"$f":"AS56*AV11","v":0},{"$f":"AS56*AR11","v":0},{"$f":"AS56*AS11/60","v":0}]
[null,{"$f":"ProjectData!D55","v":1},null,36,12,2,3.5,4.5,0,8,{"$f":"J57*G11","v":30.4},{"$f":"J57*G13","v":182.4},{"$f":"K57*'CTI Input Sheet'!B28","v":45.599999999999994},{"$f":"K57*'CTI Input Sheet'!C28","v":7.6},{"$f":"K57*'CTI Input Sheet'!D28","v":0},235.6,null,null,null,2,30.4,235.6,{"$f":"T57*'CTI Input Sheet'!K21","v":3},{"$f":"SUM(T57*H11)/60","v":0.5},null,0,0,2,8,0,0,null,{"$f":"SUM(AB57*AH8)+(AC57*AH9)","v":22},{"$f":"SUM(AD57*AH10)+(AD57*AH11)","v":0},22,null,{"$f":"(B57*2)*AO6/60","v":3.3333333333333333E-2},{"$f":"AB57*AO8/60","v":6.6666666666666666E-2},{"$f":"AD57*AO9","v":0},0.1,{"$f":"AN57*AL6","v":7.5},null,{"$f":"IF(ProjectData!H$17=\"Not Required\",0,B57*2)","v":0},0,0,{"$f":"AQ57*4.29","v":0},{"$f":"AS57*AV12","v":0},{"$f":"AS57*AR12","v":0},{"$f":"AS57*AS12/60","v":0}]
[null,{"$f":"ProjectData!D56","v":0},null,36,24,2,3.5,5.5,0,0,{"$f":"J58*G11","v":0},{"$f":"J58*G13","v":0},{"$f":"K58*'CTI Input Sheet'!B28","v":0},{"$f":"K58*'CTI Input Sheet'!C28","v":0},{"$f":"K58*'CTI Input Sheet'!D28","v":0},0,null,null,null,0,0,0,{"$f":"T58*'CTI Input Sheet'!K21","v":0},{"$f":"SUM(T58*H11)/60","v":0},null,0,0,0,0,0,0,null,{"$f":"SUM(AB58*AH8)+(AC58*AH9)","v":0},{"$f":"SUM(AD58*AH10)+(AD58*AH11)","v":0},0,null,{"$f":"(B58*2)*AO6/60","v":0},{"$f":"AB58*AO8/60","v":0},{"$f":"AD58*AO9","v":0},0,{"$f":"AN58*AL6","v":0},null,{"$f":"IF(ProjectData!H$17=\"Not Required\",0,B58*2)","v":0},0,0,{"$f":"AQ58*6.01","v":0},{"$f":"AS58*AV12","v":0},{"$f":"AS58*AR12","v":0},{"$f":"AS58*AS12/60","v":0}]
[null,{"$f":"ProjectData!D57","v":0},null,36,36,2,3.5,6.5,0,0,{"$f":"J59*G11","v":0},{"$f":"J59*G13","v":0},{"$f":"K59*'CTI Input Sheet'!B28","v":0},{"$f":"K59*'CTI Input Sheet'!C28","v":0},{"$f":"K59*'CTI Input Sheet'!D28","v":0},{"$f":"SUM(L59:O59)","v":0},null,null,null,0,0,0,{"$f":"T59*'CTI Input Sheet'!K21","v":0},{"$f":"SUM(T59*H11)/60","v":0},null,0,0,0,0,0,0,null,{"$f":"SUM(AB59*AH8)+(AC59*AH9)","v":0},{"$f":"SUM(AD59*AH10)+(AD59*AH11)","v":0},0,null,{"$f":"(B59*2)*AO6/60","v":0},{"$f":"AB59*AO8/60","v":0},{"$f":"AD59*AO9","v":0},0,{"$f":"AN59*AL6","v":0},null,{"$f":"IF(ProjectData!H$17=\"Not Required\",0,B59*2)","v":0},0,0,{"$f":"AQ59*7.73","v":0},{"$f":"AS59*AV12","v":0},{"$f":"AS59*AR12","v":0},{"$f":"AS59*AS12/60","v":0}]
[null,{"$f":"SUM(B39:B59)","v":4},null,null,null,null,null,null,null,{"$f":"SUM(J39:J59)","v":20},76,456,113.99999999999999,19,0,589,null,null,null,{"$f":"SUM(T39:T59)","v":8},{"$f":"SUM(U39:U59)","v":76},{"$f":"SUM(V39:V59)","v":589},{"$f":"SUM(W39:W59)","v":12},{"$f":"SUM(X39:X59)","v":2},null,{"$f":"SUM(Z39:Z59)","v":0},0,8,32,0,0,null,{"$f":"SUM(AG39:AG59)","v":88},{"$f":"SUM(AH39:AH59)","v":0},{"$f":"SUM(AI39:AI59)","v":88},null,{"$f":"SUM(AK39:AK59)","v":0.13333333333333333},{"$f":"SUM(AL39:AL59)","v":0.26666666666666666},{"$f":"SUM(AM39:AM59)","v":0},{"$f":"SUM(AN39:AN59)","v":0.4},{"$f":"SUM(AO39:AO59)","v":30.000000000000004},null,{"$f":"SUM(AQ39:AQ59)","v":0},0,0,0,0,0,0]
[null,null,null,null,null,null,null,null,null,null,null,null,null,null,null,null,null,null,null,null,null,null,{"$f":"W60*'CTI Input Sheet'!H7","v":900},{"$f":"X60*'CTI Input Sheet'!H6","v":150},null,null,{"$f":"AA60*AH12","v":0},{"$f":"AB60*AH8","v":48},{"$f":"AC60*AH9","v":40},{"$f":"AD60*AH10","v":0},{"$f":"AE60*AH11","v":0},null,null,null,null,null,{"$f":"AK60*AL6","v":10},{"$f":"AL60*AL6","v":20},{"$f":"AM60*AL6","v":0}]
[null,"HT Fittings",null,"HT Fittings",null,"TSS : HT Support Quantity - Support Weight - Support Steel, Fabrication, Logistics, Erection Costs",null,null,null,null,null,null,null,null,null,null,null,null,null,"HT : Support Structure Summary",null,null,null,null,null,"HT : Tray Accessory Quantities ",null,null,null,null,null,null,"HT : Tray Accessory Costs ",null,null,null,"HT : Tray Accessory Installation Time & Installation Cost",null,null,null,null,null,"HT Covers"]
[null,"Quantities",null,"HB Width (in)","HB Radius (in) ","Support Quantity","OS1 Str. Section Length (FT)","OS2 Str. Section Length (FT)","OS3 Str. Section Length (FT)","CTR Str. Section Length (FT)","Total Str. Section Length (FT)","Total Str. Section Weight (LBS)","Total Str. Section Cost (USD)","Total Fabrication Cost (USD)","Total Logistic Cost (USD)","Total Erection Cost (USD)","SUM TOTAL COST/FITTING",null,null,"Total Quantity of Supports","Total Weight of Supports (LB)","Total Cost of Supports (USD)","Total Design Time (HOURS)","Total Support Instal Time (HOURS)",null,"Integral Link Quantity (PAIRS)","Integral ink Hardware Quantity (PCS)","Hold Down Clamp Quantity (PR)","Clamp Hardware Quantity (PCS)","Expansion Guides Quantity (PR)","Guides Hardware Quantity (PCS)",null,"Hold Down Clamps Cost/Pair (USD)","Exp. Guides Cost/Pair (USD)","Total Accessory Cost (USD)",null,"TOUGHLink Time/Pair (HRS)","Hold Down Clamp Time/Pair (HRS)","Exp. Guide Time/Pair (HRS)","Total Time (HOURS)","Total Time Cost (USD)",null,"Cover Quantity (PCS)","Clamp Quantity (PCS)","TOUGHTorx Quantity (PCS)","Cover Weight (LBS)","TOUGHTorx Weight (LBS)","Clamps Cost (USD)","Installation Time (HOURS)"]
[null,{"$f":"ProjectData!D61","v":0},null,6,12,3,1,1,2.5,0,{"$f":"SUM(G64+H64+I64+J64)*B64","v":0},{"$f":"K64*G11","v":0},{"$f":"K64*G13","v":0},{"$f":"L64*'CTI Input Sheet'!B28","v":0},{"$f":"L64*'CTI Input Sheet'!C28","v":0},{"$f":"L64*'CTI Input Sheet'!D28","v":0},{"$f":"SUM(M64:P64)","v":0},null,null,{"$f":"B64*F64","v":0},{"$f":"L64","v":0},{"$f":"Q64","v":0},{"$f":"T64*'CTI Input Sheet'!K22","v":0},{"$f":"SUM(T64*H11)/60","v":0},null,0,{"$f":"Z64*8","v":0},{"$f":"(F64)*B64","v":0},{"$f":"AB64*4","v":0},0,0,null,{"$f":"SUM(AB64*AH8)+(AC64*AH9)","v":0},0,{"$f":"SUM(AG64:AH64)","v":0},null,{"$f":"(B64*3)*AO6/60","v":0},{"$f":"AB64*AO8/60","v":0},0,{"$f":"SUM(AK64:AM64)","v":0},{"$f":"AN64*AL6","v":0},null,{"$f":"IF(ProjectData!H$17=\"Not Required\",0,B64*2)","v":0},{"$f":"AQ64*0","v":0},{"$f":"AQ64*6","v":0},{"$f":"AQ64*0.88","v":0},{"$f":"AS64*AV6","v":0},{"$f":"AS64*AR6","v":0},{"$f":"AS64*AS6/60","v":0}]
[null,{"$f":"ProjectData!D62","v":0},null,6,24,3,1,1,3.5,0,{"$f":"SUM(G65+H65+I65+J65)*B65","v":0},{"$f":"K65*G11","v":0},{"$f":"K65*G13","v":0},{"$f":"L65*'CTI Input Sheet'!B28","v":0},{"$f":"L65*'CTI Input Sheet'!C28","v":0},{"$f":"L65*'CTI Input Sheet'!D28","v":0},{"$f":"SUM(M65:P65)","v":0},null,null,{"$f":"B65*F65","v":0},0,0,{"$f":"T65*'CTI Input Sheet'!K22","v":0},{"$f":"SUM(T65*H11)/60","v":0},null,0,0,0,0,0,0,null,{"$f":"SUM(AB65*AH8)+(AC65*AH9)","v":0},0,0,null,{"$f":"(B65*3)*AO6/60","v":0},{"$f":"AB65*AO8/60","v":0},0,0,{"$f":"AN65*AL6","v":0},null,{"$f":"IF(ProjectData!H$17=\"Not Required\",0,B65*2)","v":0},0,0,{"$f":"AQ65*1.96","v":0},{"$f":"AS65*AV6","v":0},{"$f":"AS65*AR6","v":0},{"$f":"AS65*AS6/60","v":0}]
[null,{"$f":"ProjectData!D63","v":0},null,6,36,3,1,1,4.5,0,0,{"$f":"K66*G11","v":0},{"$f":"K66*G13","v":0},{"$f":"L66*'CTI Input Sheet'!B28","v":0},{"$f":"L66*'CTI Input Sheet'!C28","v":0},{"$f":"L66*'CTI Input Sheet'!D28","v":0},0,null,null,0,0,0,{"$f":"T66*'CTI Input Sheet'!K22","v":0},{"$f":"SUM(T66*H11)/60","v":0},null,0,0,0,0,0,0,null,{"$f":"SUM(AB66*AH8)+(AC66*AH9)","v":0},0,0,null,{"$f":"(B66*3)*AO6/60","v":0},{"$f":"AB66*AO8/60","v":0},0,0,{"$f":"AN66*AL6","v":0},null,{"$f":"IF(ProjectData!H$17=\"Not Required\",0,B66*2)","v":0},0,0,{"$f":"AQ66*3.34","v":0},{"$f":"AS66*AV6","v":0},{"$f":"AS66*AR6","v":0},{"$f":"AS66*AS6/60","v":0}]
[null,{"$f":"ProjectData!D64","v":0},null,9,12,3,1.25,1.25,2.75,0,0,{"$f":"K67*G11","v":0},{"$f":"K67*G13","v":0},{"$f":"L67*'CTI Input Sheet'!B28","v":0},{"$f":"L67*'CTI Input Sheet'!C28","v":0},{"$f":"L67*'CTI Input Sheet'!D28","v":0},0,null,null,0,0,0,{"$f":"T67*'CTI Input Sheet'!K22","v":0},{"$f":"SUM(T67*H11)/60","v":0},null,0,0,0,0,0,0,null,{"$f":"SUM(AB67*AH8)+(AC67*AH9)","v":0},0,0,null,{"$f":"(B67*3)*AO6/60","v":0},{"$f":"AB67*AO8/60","v":0},0,0,{"$f":"AN67*AL6","v":0},null,{"$f":"IF(ProjectData!H$17=\"Not Required\",0,B67*2)","v":0},0,0,{"$f":"AQ67*1.26","v":0},{"$f":"AS67*AV7","v":0},{"$f":"AS67*AR7","v":0},{"$f":"AS67*AS7/60","v":0}]
[null,{"$f":"ProjectData!D65","v":0},null,9,24,3,1.25,1.25,3.75,0,0,{"$f":"K68*G11","v":0},{"$f":"K68*G13","v":0},{"$f":"L68*'CTI Input Sheet'!B28","v":0},{"$f":"L68*'CTI Input Sheet'!C28","v":0},{"$f":"L68*'CTI Input Sheet'!D28","v":0},0,null,null,0,0,0,{"$f":"T68*'CTI Input Sheet'!K22","v":0},{"$f":"SUM(T68*H11)/60","v":0},null,0,0,0,0,0,0,null,{"$f":"SUM(AB68*AH8)+(AC68*AH9)","v":0},0,0,null,{"$f":"(B68*3)*AO6/60","v":0},{"$f":"AB68*AO8/60","v":0},0,0,{"$f":"AN68*AL6","v":0},null,{"$f":"IF(ProjectData!H$17=\"Not Required\",0,B68*2)","v":0},0,0,{"$f":"AQ68*2.6","v":0},{"$f":"AS68*AV7","v":0},{"$f":"AS68*AR7","v":0},{"$f":"AS68*AS7/60","v":0}]
[null,{"$f":"ProjectData!D66","v":0},null,9,36,3,1.25,1.25,4.75,0,0,{"$f":"K69*G11","v":0},{"$f":"K69*G13","v":0},{"$f":"L69*'CTI Input Sheet'!B28","v":0},{"$f":"L69*'CTI Input Sheet'!C28","v":0},{"$f":"L69*'CTI Input Sheet'!D28","v":0},0,null,null,0,0,0,{"$f":"T69*'CTI Input Sheet'!K22","v":0},{"$f":"SUM(T69*H11)/60","v":0},null,0,0,0,0,0,0,null,{"$f":"SUM(AB69*AH8)+(AC69*AH9)","v":0},0,0,null,{"$f":"(B69*3)*AO6/60","v":0},{"$f":"AB69*AO8/60","v":0},0,0,{"$f":"AN69*AL6","v":0},null,{"$f":"IF(ProjectData!H$17=\"Not Required\",0,B69*2)","v":0},0,0,{"$f":"AQ69*4.25","v":0},{"$f":"AS69*AV7","v":0},{"$f":"AS69*AR7","v":0},{"$f":"AS69*AS7/60","v":0}]
[null,{"$f":"ProjectData!D67","v":1},null,12,12,3,1.5,1.5,3,0,6,{"$f":"K70*G11","v":22.799999999999997},{"$f":"K70*G13","v":136.80000000000001},{"$f":"L70*'CTI Input Sheet'!B28","v":34.199999999999996},{"$f":"L70*'CTI Input Sheet'!C28","v":5.6999999999999993},{"$f":"L70*'CTI Input Sheet'!D28","v":0},176.7,null,null,3,22.799999999999997,176.7,{"$f":"T70*'CTI Input Sheet'!K22","v":7.5},{"$f":"SUM(T70*H11)/60","v":0.75},null,0,0,3,12,0,0,null,{"$f":"SUM(AB70*AH8)+(AC70*AH9)","v":33},0,33,null,{"$f":"(B70*3)*AO6/60","v":0.05},{"$f":"AB70*AO8/60","v":0.1},0,0.15000000000000002,{"$f":"AN70*AL6","v":11.250000000000002},null,{"$f":"IF(ProjectData!H$17=\"Not Required\",0,B70*2)","v":0},0,0,{"$f":"AQ70*1.68","v":0},{"$f":"AS70*AV8","v":0},{"$f":"AS70*AR8","v":0},{"$f":"AS70*AS8/60","v":0}]
[null,{"$f":"ProjectData!D68","v":0},null,12,24,3,1.5,1.5,4,0,{"$f":"SUM(G71+H71+I71+J71)*B71","v":0},{"$f":"K71*G11","v":0},{"$f":"K71*G13","v":0},{"$f":"L71*'CTI Input Sheet'!B28","v":0},{"$f":"L71*'CTI Input Sheet'!C28","v":0},{"$f":"L71*'CTI Input Sheet'!D28","v":0},0,null,null,0,0,0,{"$f":"T71*'CTI Input Sheet'!K22","v":0},{"$f":"SUM(T71*H11)/60","v":0},null,0,0,0,0,0,0,null,{"$f":"SUM(AB71*AH8)+(AC71*AH9)","v":0},0,0,null,{"$f":"(B71*3)*AO6/60","v":0},{"$f":"AB71*AO8/60","v":0},0,0,{"$f":"AN71*AL6","v":0},null,{"$f":"IF(ProjectData!H$17=\"Not Required\",0,B71*2)","v":0},0,0,{"$f":"AQ71*3.29","v":0},{"$f":"AS71*AV8","v":0},{"$f":"AS71*AR8","v":0},{"$f":"AS71*AS8/60","v":0}]
[null,{"$f":"ProjectData!D69","v":0},null,12,36,3,1.5,1.5,5,0,0,{"$f":"K72*G11","v":0},{"$f":"K72*G13","v":0},{"$f":"L72*'CTI Input Sheet'!B28","v":0},{"$f":"L72*'CTI Input Sheet'!C28","v":0},{"$f":"L72*'CTI Input Sheet'!D28","v":0},0,null,null,0,0,0,{"$f":"T72*'CTI Input Sheet'!K22","v":0},{"$f":"SUM(T72*H11)/60","v":0},null,0,0,0,0,0,0,null,{"$f":"SUM(AB72*AH8)+(AC72*AH9)","v":0},0,0,null,{"$f":"(B72*3)*AO6/60","v":0},{"$f":"AB72*AO8/60","v":0},0,0,{"$f":"AN72*AL6","v":0},null,{"$f":"IF(ProjectData!H$17=\"Not Required\",0,B72*2)","v":0},0,0,{"$f":"AQ72*5.2","v":0},{"$f":"AS72*AV8","v":0},{"$f":"AS72*AR8","v":0},{"$f":"AS72*AS8/60","v":0}]
[null,{"$f":"ProjectData!D70","v":0},null,18,12,3,2,2,3.5,0,0,{"$f":"K73*G11","v":0},{"$f":"K73*G13","v":0},{"$f":"L73*'CTI Input Sheet'!B28","v":0},{"$f":"L73*'CTI Input Sheet'!C28","v":0},{"$f":"L73*'CTI Input Sheet'!D28","v":0},0,null,null,0,0,0,{"$f":"T73*'CTI Input Sheet'!K22","v":0},{"$f":"SUM(T73*H11)/60","v":0},null,0,0,0,0,0,0,null,{"$f":"SUM(AB73*AH8)+(AC73*AH9)","v":0},0,0,null,{"$f":"(B73*3)*AO6/60","v":0},{"$f":"AB73*AO8/60","v":0},0,0,{"$f":"AN73*AL6","v":0},null,{"$f":"IF(ProjectData!H$17=\"Not Required\",0,B73*2)","v":0},0,0,{"$f":"AQ73*2.65","v":0},{"$f":"AS73*AV9","v":0},{"$f":"AS73*AR9","v":0},{"$f":"AS73*AS9/60","v":0}]
[null,{"$f":"ProjectData!D71","v":0},null,18,24,3,2,2,4.5,0,0,{"$f":"K74*G11","v":0},{"$f":"K74*G13","v":0},{"$f":"L74*'CTI Input Sheet'!B28","v":0},{"$f":"L74*'CTI Input Sheet'!C28","v":0},{"$f":"L74*'CTI Input Sheet'!D28","v":0},0,null,null,0,0,0,{"$f":"T74*'CTI Input Sheet'!K22","v":0},{"$f":"SUM(T74*H11)/60","v":0},null,0,0,0,0,0,0,null,{"$f":"SUM(AB74*AH8)+(AC74*AH9)","v":0},0,0,null,{"$f":"(B74*3)*AO6/60","v":0},{"$f":"AB74*AO8/60","v":0},0,0,{"$f":"AN74*AL6","v":0},null,{"$f":"IF(ProjectData!H$17=\"Not Required\",0,B74*2)","v":0},0,0,{"$f":"AQ74*4.79","v":0},{"$f":"AS74*AV9","v":0},{"$f":"AS74*AR9","v":0},{"$f":"AS74*AS9/60","v":0}]
[null,{"$f":"ProjectData!D72","v":0},null,18,36,3,2,2,5.5,0,0,{"$f":"K75*G11","v":0},{"$f":"K75*G13","v":0},{"$f":"L75*'CTI Input Sheet'!B28","v":0},{"$f":"L75*'CTI Input Sheet'!C28","v":0},{"$f":"L75*'CTI Input Sheet'!D28","v":0},0,null,null,0,0,0,{"$f":"T75*'CTI Input Sheet'!K22","v":0},{"$f":"SUM(T75*H11)/60","v":0},null,0,0,0,0,0,0,null,{"$f":"SUM(AB75*AH8)+(AC75*AH9)","v":0},0,0,null,{"$f":"(B75*3)*AO6/60","v":0},{"$f":"AB75*AO8/60","v":0},0,0,{"$f":"AN75*AL6","v":0},null,{"$f":"IF(ProjectData!H$17=\"Not Required\",0,B75*2)","v":0},0,0,{"$f":"AQ75*7.23","v":0},{"$f":"AS75*AV9","v":0},{"$f":"AS75*AR9","v":0},{"$f":"AS75*AS9/60","v":0}]
[null,{"$f":"ProjectData!D73","v":0},null,24,12,3,2.5,2.5,4,0,0,{"$f":"K76*G11","v":0},{"$f":"K76*G13","v":0},{"$f":"L76*'CTI Input Sheet'!B28","v":0},{"$f":"L76*'CTI Input Sheet'!C28","v":0},{"$f":"L76*'CTI Input Sheet'!D28","v":0},0,null,null,0,0,0,{"$f":"T76*'CTI Input Sheet'!K22","v":0},{"$f":"SUM(T76*H11)/60","v":0},null,0,0,0,0,0,0,null,{"$f":"SUM(AB76*AH8)+(AC76*AH9)","v":0},0,0,null,{"$f":"(B76*3)*AO6/60","v":0},{"$f":"AB76*AO8/60","v":0},0,0,{"$f":"AN76*AL6","v":0},null,{"$f":"IF(ProjectData!H$17=\"Not Required\",0,B76*2)","v":0},0,0,{"$f":"AQ76*3.8","v":0},{"$f":"AS76*AV10","v":0},{"$f":"AS76*AR10","v":0},{"$f":"AS76*AS10/60","v":0}]
[null,{"$f":"ProjectData!D74","v":0},null,24,24,3,2.5,2.5,5,0,0,{"$f":"K77*G11","v":0},{"$f":"K77*G13","v":0},{"$f":"L77*'CTI Input Sheet'!B28","v":0},{"$f":"L77*'CTI Input Sheet'!C28","v":0},{"$f":"L77*'CTI Input Sheet'!D28","v":0},0,null,null,0,0,0,{"$f":"T77*'CTI Input Sheet'!K22","v":0},{"$f":"SUM(T77*H11)/60","v":0},null,0,0,0,0,0,0,null,{"$f":"SUM(AB77*AH8)+(AC77*AH9)","v":0},0,0,null,{"$f":"(B77*3)*AO6/60","v":0},{"$f":"AB77*AO8/60","v":0},0,0,{"$f":"AN77*AL6","v":0},null,{"$f":"IF(ProjectData!H$17=\"Not Required\",0,B77*2)","v":0},0,0,{"$f":"AQ77*6.47","v":0},{"$f":"AS77*AV10","v":0},{"$f":"AS77*AR10","v":0},{"$f":"AS77*AS10/60","v":0}]
[null,{"$f":"ProjectData!D75","v":0},null,24,36,3,2.5,2.5,6,0,0,{"$f":"K78*G11","v":0},{"$f":"K78*G13","v":0},{"$f":"L78*'CTI Input Sheet'!B28","v":0},{"$f":"L78*'CTI Input Sheet'!C28","v":0},{"$f":"L78*'CTI Input Sheet'!D28","v":0},0,null,null,0,0,0,{"$f":"T78*'CTI Input Sheet'!K22","v":0},{"$f":"SUM(T78*H11)/60","v":0},null,0,0,0,0,0,0,null,{"$f":"SUM(AB78*AH8)+(AC78*AH9)","v":0},0,0,null,{"$f":"(B78*3)*AO6/60","v":0},{"$f":"AB78*AO8/60","v":0},0,0,{"$f":"AN78*AL6","v":0},null,{"$f":"IF(ProjectData!H$17=\"Not Required\",0,B78*2)","v":0},0,0,{"$f":"AQ78*9.43","v":0},{"$f":"AS78*AV10","v":0},{"$f":"AS78*AR10","v":0},{"$f":"AS78*AS10/60","v":0}]
[null,{"$f":"ProjectData!D76","v":0},null,30,12,3,3,3,4.5,0,0,{"$f":"K79*G11","v":0},{"$f":"K79*G13","v":0},{"$f":"L79*'CTI Input Sheet'!B28","v":0},{"$f":"L79*'CTI Input Sheet'!C28","v":0},{"$f":"L79*'CTI Input Sheet'!D28","v":0},0,null,null,0,0,0,{"$f":"T79*'CTI Input Sheet'!K22","v":0},{"$f":"SUM(T79*H11)/60","v":0},null,0,0,0,0,0,0,null,{"$f":"SUM(AB79*AH8)+(AC79*AH9)","v":0},0,0,null,{"$f":"(B79*3)*AO6/60","v":0},{"$f":"AB79*AO8/60","v":0},0,0,{"$f":"AN79*AL6","v":0},null,{"$f":"IF(ProjectData!H$17=\"Not Required\",0,B79*2)","v":0},0,0,{"$f":"AQ79*5.13","v":0},{"$f":"AS79*AV11","v":0},{"$f":"AS79*AR11","v":0},{"$f":"AS79*AS11/60","v":0}]
[null,{"$f":"ProjectData!D77","v":0},null,30,24,3,3,3,5.5,0,0,{"$f":"K80*G11","v":0},{"$f":"K80*G13","v":0},{"$f":"L80*'CTI Input Sheet'!B28","v":0},{"$f":"L80*'CTI Input Sheet'!C28","v":0},{"$f":"L80*'CTI Input Sheet'!D28","v":0},0,null,null,0,0,0,{"$f":"T80*'CTI Input Sheet'!K22","v":0},{"$f":"SUM(T80*H11)/60","v":0},null,0,0,0,0,0,0,null,{"$f":"SUM(AB80*AH8)+(AC80*AH9)","v":0},0,0,null,{"$f":"(B80*3)*AO6/60","v":0},{"$f":"AB80*AO8/60","v":0},0,0,{"$f":"AN80*AL6","v":0},null,{"$f":"IF(ProjectData!H$17=\"Not Required\",0,B80*2)","v":0},0,0,{"$f":"AQ80*8.32","v":0},{"$f":"AS80*AV11","v":0},{"$f":"AS80*AR11","v":0},{"$f":"AS80*AS11/60","v":0}]
[null,{"$f":"ProjectData!D78","v":0},null,30,36,3,3,3,6.5,0,0,{"$f":"K81*G11","v":0},{"$f":"K81*G13","v":0},{"$f":"L81*'CTI Input Sheet'!B28","v":0},{"$f":"L81*'CTI Input Sheet'!C28","v":0},{"$f":"L81*'CTI Input Sheet'!D28","v":0},0,null,null,0,0,0,{"$f":"T81*'CTI Input Sheet'!K22","v":0},{"$f":"SUM(T81*H11)/60","v":0},null,0,0,0,0,0,0,null,{"$f":"SUM(AB81*AH8)+(AC81*AH9)","v":0},0,0,null,{"$f":"(B81*3)*AO6/60","v":0},{"$f":"AB81*AO8/60","v":0},0,0,{"$f":"AN81*AL6","v":0},null,{"$f":"IF(ProjectData!H$17=\"Not Required\",0,B81*2)","v":0},0,0,{"$f":"AQ81*11.81","v":0},{"$f":"AS81*AV11","v":0},{"$f":"AS81*AR11","v":0},{"$f":"AS81*AS11/60","v":0}]
[null,{"$f":"ProjectData!D79","v":1},null,36,12,3,3.5,3.5,5,0,12,{"$f":"K82*G11","v":45.599999999999994},{"$f":"K82*G13","v":273.60000000000002},{"$f":"L82*'CTI Input Sheet'!B28","v":68.399999999999991},{"$f":"L82*'CTI Input Sheet'!C28","v":11.399999999999999},{"$f":"L82*'CTI Input Sheet'!D28","v":0},353.4,null,null,3,45.599999999999994,353.4,{"$f":"T82*'CTI Input Sheet'!K22","v":7.5},{"$f":"SUM(T82*H11)/60","v":0.75},null,0,0,3,12,0,0,null,{"$f":"SUM(AB82*AH8)+(AC82*AH9)","v":33},0,33,null,{"$f":"(B82*3)*AO6/60","v":0.05},{"$f":"AB82*AO8/60","v":0.1},0,0.15000000000000002,{"$f":"AN82*AL6","v":11.250000000000002},null,{"$f":"IF(ProjectData!H$17=\"Not Required\",0,B82*2)","v":0},0,0,{"$f":"AQ82*6.63","v":0},{"$f":"AS82*AV12","v":0},{"$f":"AS82*AR12","v":0},{"$f":"AS82*AS12/60","v":0}]
[null,{"$f":"ProjectData!D80","v":0},null,36,24,3,3.5,3.5,6,0,0,{"$f":"K83*G11","v":0},{"$f":"K83*G13","v":0},{"$f":"L83*'CTI Input Sheet'!B28","v":0},{"$f":"L83*'CTI Input Sheet'!C28","v":0},{"$f":"L83*'CTI Input Sheet'!D28","v":0},0,null,null,0,0,0,{"$f":"T83*'CTI Input Sheet'!K22","v":0},{"$f":"SUM(T83*H11)/60","v":0},null,0,0,0,0,0,0,null,{"$f":"SUM(AB83*AH8)+(AC83*AH9)","v":0},0,0,null,{"$f":"(B83*3)*AO6/60","v":0},{"$f":"AB83*AO8/60","v":0},0,0,{"$f":"AN83*AL6","v":0},null,{"$f":"IF(ProjectData!H$17=\"Not Required\",0,B83*2)","v":0},0,0,{"$f":"AQ83*10.35","v":0},{"$f":"AS83*AV12","v":0},{"$f":"AS83*AR12","v":0},{"$f":"AS83*AS12/60","v":0}]
[null,{"$f":"ProjectData!D81","v":0},null,36,36,3,3.5,3.5,7,0,0,{"$f":"K84*G11","v":0},{"$f":"K84*G13","v":0},{"$f":"L84*'CTI Input Sheet'!B28","v":0},{"$f":"L84*'CTI Input Sheet'!C28","v":0},{"$f":"L84*'CTI Input Sheet'!D28","v":0},{"$f":"SUM(M84:P84)","v":0},null,null,0,0,0,{"$f":"T84*'CTI Input Sheet'!K22","v":0},{"$f":"SUM(T84*H11)/60","v":0},null,0,0,0,0,0,0,null,{"$f":"SUM(AB84*AH8)+(AC84*AH9)","v":0},0,0,null,{"$f":"(B84*3)*AO6/60","v":0},{"$f":"AB84*AO8/60","v":0},0,0,{"$f":"AN84*AL6","v":0},null,{"$f":"IF(ProjectData!H$17=\"Not Required\",0,B84*2)","v":0},0,0,{"$f":"AQ84*14.37","v":0},{"$f":"AS84*AV12","v":0},{"$f":"AS84*AR12","v":0},{"$f":"AS84*AS12/60","v":0}]
[null,{"$f":"SUM(B64:B84)","v":2},null,null,null,null,null,null,null,null,{"$f":"SUM(K64:K84)","v":18},68.399999999999991,410.40000000000003,102.6,17.099999999999998,0,530.09999999999991,null,null,{"$f":"SUM(T64:T84)","v":6},{"$f":"SUM(U64:U84)","v":68.399999999999991},{"$f":"SUM(V64:V84)","v":530.09999999999991},{"$f":"SUM(W64:W84)","v":15},{"$f":"SUM(X64:X84)","v":1.5},null,{"$f":"SUM(Z64:Z84)","v":0},0,6,24,0,0,null,{"$f":"SUM(AG64:AG84)","v":66},{"$f":"SUM(AH64:AH84)","v":0},{"$f":"SUM(AI64:AI84)","v":66},null,{"$f":"SUM(AK64:AK84)","v":0.1},{"$f":"SUM(AL64:AL84)","v":0.2},{"$f":"SUM(AM64:AM84)","v":0},{"$f":"SUM(AN64:AN84)","v":0.30000000000000004},{"$f":"SUM(AO64:AO84)","v":22.500000000000004},null,{"$f":"SUM(AQ64:AQ84)","v":0},0,0,0,0,0,0]
[null,null,null,null,null,null,null,null,null,null,null,null,null,null,null,null,null,null,null,null,null,null,{"$f":"W85*'CTI Input Sheet'!H7","v":1125},{"$f":"X85*'CTI Input Sheet'!H6","v":112.5},null,null,{"$f":"AA85*AH12","v":0},{"$f":"AB85*AH8","v":36},{"$f":"AC85*AH9","v":30},{"$f":"AD85*AH10","v":0},{"$f":"AE85*AH11","v":0},null,null,null,null,null,{"$f":"AK85*AL6","v":7.5},{"$f":"AL85*AL6","v":15},{"$f":"AM85*AL6","v":0}]
[null,"HX Fittings",null,"HX Fittings",null,"TSS : HX Support Quantity - Support Weight - Support Steel, Fabrication, Logistics, Erection Costs",null,null,null,null,null,null,null,null,null,null,null,null,null,"HX : Support Structure Summary",null,null,null,null,null,"HX : Tray Accessory Quantities ",null,null,null,null,null,null,"HX : Tray Accessory Costs ",null,null,null,"HX : Tray Accessory Installation Time & Installation Cost",null,null,null,null,null,"HX Covers"]
[null,"Quantities",null,"HB Width (in)","HB Radius (in) ","Support Quantity","OS1 Str. Section Length (FT)","OS2 Str. Section Length (FT)","OS3 Str. Section Length (FT)","OS4 Str. Section Length (FT)","CTR Str. Section Length (FT)","Total Str. Section Length (FT)","Total Str. Section Weight (LBS)","Total Str. Section Cost (USD)","Total Fabrication Cost (USD)","Total Logistic Cost (USD)","Total Erection Cost (USD","SUM TOTAL COST/FITTING",null,"Total Quantity of Supports","Total Weight of Supports (LB)","Total Cost of Supports (USD)","Total Design Time (HOURS)","Total Support Instal Time (HOURS)",null,"Integral Link Quantity (PAIRS)","Integral ink Hardware Quantity (PCS)","Hold Down Clamp Quantity (PR)","Clamp Hardware Quantity (PCS)","Expansion Guides Quantity (PR)","Guides Hardware Quantity (PCS)",null,"Hold Down Clamps Cost/Pair (USD)","Exp. Guides Cost/Pair (USD)","Total Accessory Cost (USD)",null,"TOUGHLink Time/Pair (HRS)","Hold Down Clamp Time/Pair (HRS)","Exp. Guide Time/Pair (HRS)","Total Time (HOURS)","Total Time Cost (USD)",null,"Cover Quantity (PCS)","Clamp Quantity (PCS)","TOUGHTorx Quantity (PCS)","Cover Weight (LBS)","TOUGHTorx Weight (LBS)","Clamps Cost (USD)","Installation Time (HOURS)"]
[null,{"$f":"ProjectData!G61","v":0},null,6,12,4,1,1,2.5,2.5,0,{"$f":"SUM(G89+H89+I89+J89+K89)*B89","v":0},{"$f":"L89*G11","v":0},{"$f":"L89*G13","v":0},{"$f":"M89*'CTI Input Sheet'!B28","v":0},{"$f":"M89*'CTI Input Sheet'!C28","v":0},{"$f":"M89*'CTI Input Sheet'!D28","v":0},{"$f":"SUM(N89:Q89)","v":0},null,{"$f":"B89*F89","v":0},{"$f":"M89","v":0},{"$f":"R89","v":0},{"$f":"T89*'CTI Input Sheet'!K23","v":0},{"$f":"SUM(T89*H11)/60","v":0},null,0,{"$f":"Z89*8","v":0},{"$f":"(F89)*B89","v":0},{"$f":"AB89*4","v":0},0,0,null,{"$f":"SUM(AB89*AH8)+(AC89*AH9)","v":0},0,{"$f":"SUM(AG89:AH89)","v":0},null,{"$f":"(B89*4)*AO6/60","v":0},{"$f":"AB89*AO8/60","v":0},0,{"$f":"SUM(AK89:AM89)","v":0},{"$f":"AN89*AL6","v":0},null,{"$f":"IF(ProjectData!H$17=\"Not Required\",0,B89*2)","v":0},{"$f":"AQ89*0","v":0},{"$f":"AQ89*8","v":0},{"$f":"AQ89*1.21","v":0},{"$f":"AS89*AV6","v":0},{"$f":"AS89*AR6","v":0},{"$f":"AS89*AS6/60","v":0}]
[null,{"$f":"ProjectData!G62","v":0},null,6,24,4,1,1,3.5,3.5,0,{"$f":"SUM(G90+H90+I90+J90+K90)*B90","v":0},{"$f":"L90*G11","v":0},{"$f":"L90*G13","v":0},{"$f":"M90*'CTI Input Sheet'!B28","v":0},{"$f":"M90*'CTI Input Sheet'!C28","v":0},{"$f":"M90*'CTI Input Sheet'!D28","v":0},0,null,{"$f":"B90*F90","v":0},0,0,{"$f":"T90*'CTI Input Sheet'!K23","v":0},{"$f":"SUM(T90*H11)/60","v":0},null,0,0,0,0,0,0,null,{"$f":"SUM(AB90*AH8)+(AC90*AH9)","v":0},0,0,null,{"$f":"(B90*4)*AO6/60","v":0},{"$f":"AB90*AO8/60","v":0},0,0,{"$f":"AN90*AL6","v":0},null,{"$f":"IF(ProjectData!H$17=\"Not Required\",0,B90*2)","v":0},0,0,{"$f":"AQ90*2.95","v":0},{"$f":"AS90*AV6","v":0},{"$f":"AS90*AR6","v":0},{"$f":"AS90*AS6/60","v":0}]
[null,{"$f":"ProjectData!G63","v":0},null,6,36,4,1,1,4.5,4.5,0,0,{"$f":"L91*G11","v":0},{"$f":"L91*G13","v":0},{"$f":"M91*'CTI Input Sheet'!B28","v":0},{"$f":"M91*'CTI Input Sheet'!C28","v":0},{"$f":"M91*'CTI Input Sheet'!D28","v":0},0,null,0,0,0,{"$f":"T91*'CTI Input Sheet'!K23","v":0},{"$f":"SUM(T91*H11)/60","v":0},null,0,0,0,0,0,0,null,{"$f":"SUM(AB91*AH8)+(AC91*AH9)","v":0},0,0,null,{"$f":"(B91*4)*AO6/60","v":0},{"$f":"AB91*AO8/60","v":0},0,0,{"$f":"AN91*AL6","v":0},null,{"$f":"IF(ProjectData!H$17=\"Not Required\",0,B91*2)","v":0},0,0,{"$f":"AQ91*5.28","v":0},{"$f":"AS91*AV6","v":0},{"$f":"AS91*AR6","v":0},{"$f":"AS91*AS6/60","v":0}]
[null,{"$f":"ProjectData!G64","v":0},null,9,12,4,1.25,1.25,2.75,2.75,0,0,{"$f":"L92*G11","v":0},{"$f":"L92*G13","v":0},{"$f":"M92*'CTI Input Sheet'!B28","v":0},{"$f":"M92*'CTI Input Sheet'!C28","v":0},{"$f":"M92*'CTI Input Sheet'!D28","v":0},0,null,0,0,0,{"$f":"T92*'CTI Input Sheet'!K23","v":0},{"$f":"SUM(T92*H11)/60","v":0},null,0,0,0,0,0,0,null,{"$f":"SUM(AB92*AH8)+(AC92*AH9)","v":0},0,0,null,{"$f":"(B92*4)*AO6/60","v":0},{"$f":"AB92*AO8/60","v":0},0,0,{"$f":"AN92*AL6","v":0},null,{"$f":"IF(ProjectData!H$17=\"Not Required\",0,B92*2)","v":0},0,0,{"$f":"AQ92*1.68","v":0},{"$f":"AS92*AV7","v":0},{"$f":"AS92*AR7","v":0},{"$f":"AS92*AS7/60","v":0}]
[null,{"$f":"ProjectData!G65","v":0},null,9,24,4,1.25,1.25,3.75,3.75,0,0,{"$f":"L93*G11","v":0},{"$f":"L93*G13","v":0},{"$f":"M93*'CTI Input Sheet'!B28","v":0},{"$f":"M93*'CTI Input Sheet'!C28","v":0},{"$f":"M93*'CTI Input Sheet'!D28","v":0},0,null,0,0,0,{"$f":"T93*'CTI Input Sheet'!K23","v":0},{"$f":"SUM(T93*H11)/60","v":0},null,0,0,0,0,0,0,null,{"$f":"SUM(AB93*AH8)+(AC93*AH9)","v":0},0,0,null,{"$f":"(B93*4)*AO6/60","v":0},{"$f":"AB93*AO8/60","v":0},0,0,{"$f":"AN93*AL6","v":0},null,{"$f":"IF(ProjectData!H$17=\"Not Required\",0,B93*2)","v":0},0,0,{"$f":"AQ93*3.76","v":0},{"$f":"AS93*AV7","v":0},{"$f":"AS93*AR7","v":0},{"$f":"AS93*AS7/60","v":0}]
[null,{"$f":"ProjectData!G66","v":0},null,9,36,4,1.25,1.25,4.75,4.75,0,0,{"$f":"L94*G11","v":0},{"$f":"L94*G13","v":0},{"$f":"M94*'CTI Input Sheet'!B28","v":0},{"$f":"M94*'CTI Input Sheet'!C28","v":0},{"$f":"M94*'CTI Input Sheet'!D28","v":0},0,null,0,0,0,{"$f":"T94*'CTI Input Sheet'!K23","v":0},{"$f":"SUM(T94*H11)/60","v":0},null,0,0,0,0,0,0,null,{"$f":"SUM(AB94*AH8)+(AC94*AH9)","v":0},0,0,null,{"$f":"(B94*4)*AO6/60","v":0},{"$f":"AB94*AO8/60","v":0},0,0,{"$f":"AN94*AL6","v":0},null,{"$f":"IF(ProjectData!H$17=\"Not Required\",0,B94*2)","v":0},0,0,{"$f":"AQ94*6.45","v":0},{"$f":"AS94*AV7","v":0},{"$f":"AS94*AR7","v":0},{"$f":"AS94*AS7/60","v":0}]
[null,{"$f":"ProjectData!G67","v":0},null,12,12,4,1.5,1.5,3,3,0,0,{"$f":"L95*G11","v":0},{"$f":"L95*G13","v":0},{"$f":"M95*'CTI Input Sheet'!B28","v":0},{"$f":"M95*'CTI Input Sheet'!C28","v":0},{"$f":"M95*'CTI Input Sheet'!D28","v":0},0,null,0,0,0,{"$f":"T95*'CTI Input Sheet'!K23","v":0},{"$f":"SUM(T95*H11)/60","v":0},null,0,0,0,0,0,0,null,{"$f":"SUM(AB95*AH8)+(AC95*AH9)","v":0},0,0,null,{"$f":"(B95*4)*AO6/60","v":0},{"$f":"AB95*AO8/60","v":0},0,0,{"$f":"AN95*AL6","v":0},null,{"$f":"IF(ProjectData!H$17=\"Not Required\",0,B95*2)","v":0},0,0,{"$f":"AQ95*2.18","v":0},{"$f":"AS95*AV8","v":0},{"$f":"AS95*AR8","v":0},{"$f":"AS95*AS8/60","v":0}]
[null,{"$f":"ProjectData!G68","v":0},null,12,24,4,1.5,1.5,4,4,0,0,{"$f":"L96*G11","v":0},{"$f":"L96*G13","v":0},{"$f":"M96*'CTI Input Sheet'!B28","v":0},{"$f":"M96*'CTI Input Sheet'!C28","v":0},{"$f":"M96*'CTI Input Sheet'!D28","v":0},0,null,0,0,0,{"$f":"T96*'CTI Input Sheet'!K23","v":0},{"$f":"SUM(T96*H11)/60","v":0},null,0,0,0,0,0,0,null,{"$f":"SUM(AB96*AH8)+(AC96*AH9)","v":0},0,0,null,{"$f":"(B96*4)*AO6/60","v":0},{"$f":"AB96*AO8/60","v":0},0,0,{"$f":"AN96*AL6","v":0},null,{"$f":"IF(ProjectData!H$17=\"Not Required\",0,B96*2)","v":0},0,0,{"$f":"AQ96*4.62","v":0},{"$f":"AS96*AV8","v":0},{"$f":"AS96*AR8","v":0},{"$f":"AS96*AS8/60","v":0}]
[null,{"$f":"ProjectData!G69","v":0},null,12,36,4,1.5,1.5,5,5,0,0,{"$f":"L97*G11","v":0},{"$f":"L97*G13","v":0},{"$f":"M97*'CTI Input Sheet'!B28","v":0},{"$f":"M97*'CTI Input Sheet'!C28","v":0},{"$f":"M97*'CTI Input Sheet'!D28","v":0},0,null,0,0,0,{"$f":"T97*'CTI Input Sheet'!K23","v":0},{"$f":"SUM(T97*H11)/60","v":0},null,0,0,0,0,0,0,null,{"$f":"SUM(AB97*AH8)+(AC97*AH9)","v":0},0,0,null,{"$f":"(B97*4)*AO6/60","v":0},{"$f":"AB97*AO8/60","v":0},0,0,{"$f":"AN97*AL6","v":0},null,{"$f":"IF(ProjectData!H$17=\"Not Required\",0,B97*2)","v":0},0,0,{"$f":"AQ97*7.65","v":0},{"$f":"AS97*AV8","v":0},{"$f":"AS97*AR8","v":0},{"$f":"AS97*AS8/60","v":0}]
[null,{"$f":"ProjectData!G70","v":0},null,18,12,4,2,2,3.5,3.5,0,0,{"$f":"L98*G11","v":0},{"$f":"L98*G13","v":0},{"$f":"M98*'CTI Input Sheet'!B28","v":0},{"$f":"M98*'CTI Input Sheet'!C28","v":0},{"$f":"M98*'CTI Input Sheet'!D28","v":0},0,null,0,0,0,{"$f":"T98*'CTI Input Sheet'!K23","v":0},{"$f":"SUM(T98*H11)/60","v":0},null,0,0,0,0,0,0,null,{"$f":"SUM(AB98*AH8)+(AC98*AH9)","v":0},0,0,null,{"$f":"(B98*4)*AO6/60","v":0},{"$f":"AB98*AO8/60","v":0},0,0,{"$f":"AN98*AL6","v":0},null,{"$f":"IF(ProjectData!H$17=\"Not Required\",0,B98*2)","v":0},0,0,{"$f":"AQ98*3.32","v":0},{"$f":"AS98*AV9","v":0},{"$f":"AS98*AR9","v":0},{"$f":"AS98*AS9/60","v":0}]
[null,{"$f":"ProjectData!G71","v":0},null,18,24,4,2,2,4.5,4.5,0,0,{"$f":"L99*G11","v":0},{"$f":"L99*G13","v":0},{"$f":"M99*'CTI Input Sheet'!B28","v":0},{"$f":"M99*'CTI Input Sheet'!C28","v":0},{"$f":"M99*'CTI Input Sheet'!D28","v":0},0,null,0,0,0,{"$f":"T99*'CTI Input Sheet'!K23","v":0},{"$f":"SUM(T99*H11)/60","v":0},null,0,0,0,0,0,0,null,{"$f":"SUM(AB99*AH8)+(AC99*AH9)","v":0},0,0,null,{"$f":"(B99*4)*AO6/60","v":0},{"$f":"AB99*AO8/60","v":0},0,0,{"$f":"AN99*AL6","v":0},null,{"$f":"IF(ProjectData!H$17=\"Not Required\",0,B99*2)","v":0},0,0,{"$f":"AQ99*6.46","v":0},{"$f":"AS99*AV9","v":0},{"$f":"AS99*AR9","v":0},{"$f":"AS99*AS9/60","v":0}]
[null,{"$f":"ProjectData!G72","v":0},null,18,36,4,2,2,5.5,5.5,0,0,{"$f":"L100*G11","v":0},{"$f":"L100*G13","v":0},{"$f":"M100*'CTI Input Sheet'!B28","v":0},{"$f":"M100*'CTI Input Sheet'!C28","v":0},{"$f":"M100*'CTI Input Sheet'!D28","v":0},0,null,0,0,0,{"$f":"T100*'CTI Input Sheet'!K23","v":0},{"$f":"SUM(T100*H11)/60","v":0},null,0,0,0,0,0,0,null,{"$f":"SUM(AB100*AH8)+(AC100*AH9)","v":0},0,0,null,{"$f":"(B100*4)*AO6/60","v":0},{"$f":"AB100*AO8/60","v":0},0,0,{"$f":"AN100*AL6","v":0},null,{"$f":"IF(ProjectData!H$17=\"Not Required\",0,B100*2)","v":0},0,0,{"$f":"AQ100*10.2","v":0},{"$f":"AS100*AV9","v":0},{"$f":"AS100*AR9","v":0},{"$f":"AS100*AS9/60","v":0}]
[null,{"$f":"ProjectData!G73","v":0},null,24,12,4,2.5,2.5,4,4,0,0,{"$f":"L101*G11","v":0},{"$f":"L101*G13","v":0},{"$f":"M101*'CTI Input Sheet'!B28","v":0},{"$f":"M101*'CTI Input Sheet'!C28","v":0},{"$f":"M101*'CTI Input Sheet'!D28","v":0},0,null,0,0,0,{"$f":"T101*'CTI Input Sheet'!K23","v":0},{"$f":"SUM(T101*H11)/60","v":0},null,0,0,0,0,0,0,null,{"$f":"SUM(AB101*AH8)+(AC101*AH9)","v":0},0,0,null,{"$f":"(B101*4)*AO6/60","v":0},{"$f":"AB101*AO8/60","v":0},0,0,{"$f":"AN101*AL6","v":0},null,{"$f":"IF(ProjectData!H$17=\"Not Required\",0,B101*2)","v":0},0,0,{"$f":"AQ101*4.64","v":0},{"$f":"AS101*AV10","v":0},{"$f":"AS101*AR10","v":0},{"$f":"AS101*AS10/60","v":0}]
[null,{"$f":"ProjectData!G74","v":0},null,24,24,4,2.5,2.5,5,5,0,0,{"$f":"L102*G11","v":0},{"$f":"L102*G13","v":0},{"$f":"M102*'CTI Input Sheet'!B28","v":0},{"$f":"M102*'CTI Input Sheet'!C28","v":0},{"$f":"M102*'CTI Input Sheet'!D28","v":0},0,null,0,0,0,{"$f":"T102*'CTI Input Sheet'!K23","v":0},{"$f":"SUM(T102*H11)/60","v":0},null,0,0,0,0,0,0,null,{"$f":"SUM(AB102*AH8)+(AC102*AH9)","v":0},0,0,null,{"$f":"(B102*4)*AO6/60","v":0},{"$f":"AB102*AO8/60","v":0},0,0,{"$f":"AN102*AL6","v":0},null,{"$f":"IF(ProjectData!H$17=\"Not Required\",0,B102*2)","v":0},0,0,{"$f":"AQ102*8.48","v":0},{"$f":"AS102*AV10","v":0},{"$f":"AS102*AR10","v":0},{"$f":"AS102*AS10/60","v":0}]
[null,{"$f":"ProjectData!G75","v":0},null,24,36,4,2.5,2.5,6,6,0,0,{"$f":"L103*G11","v":0},{"$f":"L103*G13","v":0},{"$f":"M103*'CTI Input Sheet'!B28","v":0},{"$f":"M103*'CTI Input Sheet'!C28","v":0},{"$f":"M103*'CTI Input Sheet'!D28","v":0},0,null,0,0,0,{"$f":"T103*'CTI Input Sheet'!K23","v":0},{"$f":"SUM(T103*H11)/60","v":0},null,0,0,0,0,0,0,null,{"$f":"SUM(AB103*AH8)+(AC103*AH9)","v":0},0,0,null,{"$f":"(B103*4)*AO6/60","v":0},{"$f":"AB103*AO8/60","v":0},0,0,{"$f":"AN103*AL6","v":0},null,{"$f":"IF(ProjectData!H$17=\"Not Required\",0,B103*2)","v":0},0,0,{"$f":"AQ103*12.92","v":0},{"$f":"AS103*AV10","v":0},{"$f":"AS103*AR10","v":0},{"$f":"AS103*AS10/60","v":0}]
[null,{"$f":"ProjectData!G76","v":0},null,30,12,4,3,3,4.5,4.5,0,0,{"$f":"L104*G11","v":0},{"$f":"L104*G13","v":0},{"$f":"M104*'CTI Input Sheet'!B28","v":0},{"$f":"M104*'CTI Input Sheet'!C28","v":0},{"$f":"M104*'CTI Input Sheet'!D28","v":0},0,null,0,0,0,{"$f":"T104*'CTI Input Sheet'!K23","v":0},{"$f":"SUM(T104*H11)/60","v":0},null,0,0,0,0,0,0,null,{"$f":"SUM(AB104*AH8)+(AC104*AH9)","v":0},0,0,null,{"$f":"(B104*4)*AO6/60","v":0},{"$f":"AB104*AO8/60","v":0},0,0,{"$f":"AN104*AL6","v":0},null,{"$f":"IF(ProjectData!H$17=\"Not Required\",0,B104*2)","v":0},0,0,{"$f":"AQ104*6.13","v":0},{"$f":"AS104*AV11","v":0},{"$f":"AS104*AR11","v":0},{"$f":"AS104*AS11/60","v":0}]
[null,{"$f":"ProjectData!G77","v":0},null,30,24,4,3,3,5.5,5.5,0,0,{"$f":"L105*G11","v":0},{"$f":"L105*G13","v":0},{"$f":"M105*'CTI Input Sheet'!B28","v":0},{"$f":"M105*'CTI Input Sheet'!C28","v":0},{"$f":"M105*'CTI Input Sheet'!D28","v":0},0,null,0,0,0,{"$f":"T105*'CTI Input Sheet'!K23","v":0},{"$f":"SUM(T105*H11)/60","v":0},null,0,0,0,0,0,0,null,{"$f":"SUM(AB105*AH8)+(AC105*AH9)","v":0},0,0,null,{"$f":"(B105*4)*AO6/60","v":0},{"$f":"AB105*AO8/60","v":0},0,0,{"$f":"AN105*AL6","v":0},null,{"$f":"IF(ProjectData!H$17=\"Not Required\",0,B105*2)","v":0},0,0,{"$f":"AQ105*10.67","v":0},{"$f":"AS105*AV11","v":0},{"$f":"AS105*AR11","v":0},{"$f":"AS105*AS11/60","v":0}]
[null,{"$f":"ProjectData!G78","v":0},null,30,36,4,3,3,6.5,6.5,0,0,{"$f":"L106*G11","v":0},{"$f":"L106*G13","v":0},{"$f":"M106*'CTI Input Sheet'!B28","v":0},{"$f":"M106*'CTI Input Sheet'!C28","v":0},{"$f":"M106*'CTI Input Sheet'!D28","v":0},0,null,0,0,0,{"$f":"T106*'CTI Input Sheet'!K23","v":0},{"$f":"SUM(T106*H11)/60","v":0},null,0,0,0,0,0,0,null,{"$f":"SUM(AB106*AH8)+(AC106*AH9)","v":0},0,0,null,{"$f":"(B106*4)*AO6/60","v":0},{"$f":"AB106*AO8/60","v":0},0,0,{"$f":"AN106*AL6","v":0},null,{"$f":"IF(ProjectData!H$17=\"Not Required\",0,B106*2)","v":0},0,0,{"$f":"AQ106*15.82","v":0},{"$f":"AS106*AV11","v":0},{"$f":"AS106*AR11","v":0},{"$f":"AS106*AS11/60","v":0}]
[null,{"$f":"ProjectData!G79","v":0},null,36,12,4,3.5,3.5,5,5,0,0,{"$f":"L107*G11","v":0},{"$f":"L107*G13","v":0},{"$f":"M107*'CTI Input Sheet'!B28","v":0},{"$f":"M107*'CTI Input Sheet'!C28","v":0},{"$f":"M107*'CTI Input Sheet'!D28","v":0},0,null,0,0,0,{"$f":"T107*'CTI Input Sheet'!K23","v":0},{"$f":"SUM(T107*H11)/60","v":0},null,0,0,0,0,0,0,null,{"$f":"SUM(AB107*AH8)+(AC107*AH9)","v":0},0,0,null,{"$f":"(B107*4)*AO6/60","v":0},{"$f":"AB107*AO8/60","v":0},0,0,{"$f":"AN107*AL6","v":0},null,{"$f":"IF(ProjectData!H$17=\"Not Required\",0,B107*2)","v":0},0,0,{"$f":"AQ107*7.8","v":0},{"$f":"AS107*AV12","v":0},{"$f":"AS107*AR12","v":0},{"$f":"AS107*AS12/60","v":0}]
[null,{"$f":"ProjectData!G80","v":0},null,36,24,4,3.5,3.5,6,6,0,0,{"$f":"L108*G11","v":0},{"$f":"L108*G13","v":0},{"$f":"M108*'CTI Input Sheet'!B28","v":0},{"$f":"M108*'CTI Input Sheet'!C28","v":0},{"$f":"M108*'CTI Input Sheet'!D28","v":0},0,null,0,0,0,{"$f":"T108*'CTI Input Sheet'!K23","v":0},{"$f":"SUM(T108*H11)/60","v":0},null,0,0,0,0,0,0,null,{"$f":"SUM(AB108*AH8)+(AC108*AH9)","v":0},0,0,null,{"$f":"(B108*4)*AO6/60","v":0},{"$f":"AB108*AO8/60","v":0},0,0,{"$f":"AN108*AL6","v":0},null,{"$f":"IF(ProjectData!H$17=\"Not Required\",0,B108*2)","v":0},0,0,{"$f":"AQ108*13.04","v":0},{"$f":"AS108*AV12","v":0},{"$f":"AS108*AR12","v":0},{"$f":"AS108*AS12/60","v":0}]
[null,{"$f":"ProjectData!G81","v":0},null,36,36,4,3.5,3.5,7,7,0,0,{"$f":"L109*G11","v":0},{"$f":"L109*G13","v":0},{"$f":"M109*'CTI Input Sheet'!B28","v":0},{"$f":"M109*'CTI Input Sheet'!C28","v":0},{"$f":"M109*'CTI Input Sheet'!D28","v":0},0,null,0,0,0,{"$f":"T109*'CTI Input Sheet'!K23","v":0},{"$f":"SUM(T109*H11)/60","v":0},null,0,0,0,0,0,0,null,{"$f":"SUM(AB109*AH8)+(AC109*AH9)","v":0},0,0,null,{"$f":"(B109*4)*AO6/60","v":0},{"$f":"AB109*AO8/60","v":0},0,0,{"$f":"AN109*AL6","v":0},null,{"$f":"IF(ProjectData!H$17=\"Not Required\",0,B109*2)","v":0},0,0,{"$f":"AQ109*18.89","v":0},{"$f":"AS109*AV12","v":0},{"$f":"AS109*AR12","v":0},{"$f":"AS109*AS12/60","v":0}]
[null,{"$f":"SUM(B89:B109)","v":0},null,null,null,null,null,null,null,null,null,{"$f":"SUM(L89:L109)","v":0},0,0,0,0,0,0,null,{"$f":"SUM(T89:T109)","v":0},{"$f":"SUM(U89:U109)","v":0},{"$f":"SUM(V89:V109)","v":0},{"$f":"SUM(W89:W109)","v":0},{"$f":"SUM(X89:X109)","v":0},null,{"$f":"SUM(Z89:Z109)","v":0},0,0,0,0,0,null,{"$f":"SUM(AG89:AG109)","v":0},{"$f":"SUM(AH89:AH109)","v":0},{"$f":"SUM(AI89:AI109)","v":0},null,{"$f":"SUM(AK89:AK109)","v":0},{"$f":"SUM(AL89:AL109)","v":0},{"$f":"SUM(AM89:AM109)","v":0},{"$f":"SUM(AN89:AN109)","v":0},{"$f":"SUM(AO89:AO109)","v":0},null,{"$f":"SUM(AQ89:AQ109)","v":0},0,0,0,0,0,0]
[null,null,null,null,null,null,null,null,null,null,null,null,null,null,null,null,null,null,null,null,null,null,{"$f":"W110*'CTI Input Sheet'!H7","v":0},{"$f":"X110*'CTI Input Sheet'!H6","v":0},null,null,{"$f":"AA110*AH12","v":0},{"$f":"AB110*AH8","v":0},{"$f":"AC110*AH9","v":0},{"$f":"AD110*AH10","v":0},{"$f":"AE110*AH11","v":0},null,null,null,null,null,{"$f":"AK110*AL6","v":0},{"$f":"AL110*AL6","v":0},{"$f":"AM110*AL6","v":0}]
[null,"Vertical VI Fittings",null,"Vertical VI Fittings",null,"TSS : Vertical VI Support Quantity - Support Weight - Support Steel, Fabrication, Logistics, Erection Costs",null,null,null,null,null,null,null,null,null,null,null,null,null,"VI : Support Structure Summary",null,null,null,null,null,"VI : Tray Accessory Quantities ",null,null,null,null,null,null,"VI : Tray Accessory Costs ",null,null,null,"VI : Tray Accessory Installation Time & Installation Cost",null,null,null,null,null,"VI Covers"]
[null,"Quantities",null,"HB Width (in)","HB Radius (in) ","Support Quantity","OS1 Str. Section Length (FT)","OS2 Str. Section Length (FT)","Total Str. Section Length (FT)","Total Str. Section Weight (LBS)","Total Str. Section Cost (USD)","Total Fabrication Cost (USD)","Total Logistic Cost (USD)","Total Erection Cost (USD","SUM TOTAL COST/FITTING",null,null,null,null,"Total Quantity of Supports","Total Weight of Supports (LB)","Total Cost of Supports (USD)","Total Design Time (HOURS)","Total Support Instal Time (HOURS)",null,"Integral Link Quantity (PAIRS)","Integral ink Hardware Quantity (PCS)","Hold Down Clamp Quantity (PR)","Clamp Hardware Quantity (PCS)","Expansion Guides Quantity (PR)","Guides Hardware Quantity (PCS)",null,"Hold Down Clamps Cost/Pair (USD)","Exp. Guides Cost/Pair (USD)","Total Accessory Cost (USD)",null,"TOUGHLink Time/Pair (HRS)","Hold Down Clamp Time/Pair (HRS)","Exp. Guide Time/Pair (HRS)","Total Time (HOURS)","Total Time Cost (USD)",null,"Cover Quantity (PCS)","Clamp Quantity (PCS)","TOUGHTorx Quantity (PCS)","Cover Weight (LBS)","TOUGHTorx Weight (LBS)","Clamps Cost (USD)","Installation Time (HOURS)"]
[null,{"$f":"ProjectData!G37","v":0},null,6,12,1,1,0,{"$f":"SUM(G114+H114)*B114","v":0},{"$f":"I114*G11","v":0},{"$f":"I114*G13","v":0},{"$f":"J114*'CTI Input Sheet'!B28","v":0},{"$f":"J114*'CTI Input Sheet'!C28","v":0},{"$f":"J114*'CTI Input Sheet'!D28","v":0},{"$f":"SUM(L114:N114)","v":0},null,null,null,null,{"$f":"B114*F114","v":0},{"$f":"J114","v":0},{"$f":"O114","v":0},{"$f":"T114*'CTI Input Sheet'!K24","v":0},{"$f":"SUM(T114*H11)/60","v":0},null,0,{"$f":"Z114*8","v":0},{"$f":"(F114)*B114","v":0},{"$f":"AB114*4","v":0},0,0,null,{"$f":"SUM(AB114*AH8)+(AC114*AH9)","v":0},0,{"$f":"SUM(AG114:AH114)","v":0},null,{"$f":"(B114*2)*AO6/60","v":0},{"$f":"AB114*AO8/60","v":0},0,{"$f":"SUM(AK114:AM114)","v":0},{"$f":"AN114*AL6","v":0},null,{"$f":"IF(ProjectData!H$17=\"Not Required\",0,B114*2)","v":0},{"$f":"AQ114*0","v":0},{"$f":"AQ114*4","v":0},{"$f":"AQ114*0.39","v":0},{"$f":"AS114*AV6","v":0},{"$f":"AS114*AR6","v":0},{"$f":"AS114*AS6/60","v":0}]
[null,{"$f":"ProjectData!G38","v":0},null,6,24,1,1,0,{"$f":"SUM(G115+H115)*B115","v":0},{"$f":"I115*G11","v":0},{"$f":"I115*G13","v":0},{"$f":"J115*'CTI Input Sheet'!B28","v":0},{"$f":"J115*'CTI Input Sheet'!C28","v":0},{"$f":"J115*'CTI Input Sheet'!D28","v":0},0,null,null,null,null,{"$f":"B115*F115","v":0},0,0,{"$f":"T115*'CTI Input Sheet'!K24","v":0},{"$f":"SUM(T115*H11)/60","v":0},null,0,0,0,0,0,0,null,{"$f":"SUM(AB115*AH8)+(AC115*AH9)","v":0},0,0,null,{"$f":"(B115*2)*AO6/60","v":0},{"$f":"AB115*AO8/60","v":0},0,0,{"$f":"AN115*AL6","v":0},null,{"$f":"IF(ProjectData!H$17=\"Not Required\",0,B115*2)","v":0},0,0,{"$f":"AQ115*0.63","v":0},{"$f":"AS115*AV6","v":0},{"$f":"AS115*AR6","v":0},{"$f":"AS115*AS6/60","v":0}]
[null,{"$f":"ProjectData!G39","v":0},null,6,36,1,1,0,0,{"$f":"I116*G11","v":0},{"$f":"I116*G13","v":0},{"$f":"J116*'CTI Input Sheet'!B28","v":0},{"$f":"J116*'CTI Input Sheet'!C28","v":0},{"$f":"J116*'CTI Input Sheet'!D28","v":0},0,null,null,null,null,0,0,0,{"$f":"T116*'CTI Input Sheet'!K24","v":0},{"$f":"SUM(T116*H11)/60","v":0},null,0,0,0,0,0,0,null,{"$f":"SUM(AB116*AH8)+(AC116*AH9)","v":0},0,0,null,{"$f":"(B116*2)*AO6/60","v":0},{"$f":"AB116*AO8/60","v":0},0,0,{"$f":"AN116*AL6","v":0},null,{"$f":"IF(ProjectData!H$17=\"Not Required\",0,B116*2)","v":0},0,0,{"$f":"AQ116*0.97","v":0},{"$f":"AS116*AV6","v":0},{"$f":"AS116*AR6","v":0},{"$f":"AS116*AS6/60","v":0}]
[null,{"$f":"ProjectData!G40","v":0},null,9,12,1,1.25,0,0,{"$f":"I117*G11","v":0},{"$f":"I117*G13","v":0},{"$f":"J117*'CTI Input Sheet'!B28","v":0},{"$f":"J117*'CTI Input Sheet'!C28","v":0},{"$f":"J117*'CTI Input Sheet'!D28","v":0},0,null,null,null,null,0,0,0,{"$f":"T117*'CTI Input Sheet'!K24","v":0},{"$f":"SUM(T117*H11)/60","v":0},null,0,0,0,0,0,0,null,{"$f":"SUM(AB117*AH8)+(AC117*AH9)","v":0},0,0,null,{"$f":"(B117*2)*AO6/60","v":0},{"$f":"AB117*AO8/60","v":0},0,0,{"$f":"AN117*AL6","v":0},null,{"$f":"IF(ProjectData!H$17=\"Not Required\",0,B117*2)","v":0},0,0,{"$f":"AQ117*0.41","v":0},{"$f":"AS117*AV7","v":0},{"$f":"AS117*AR7","v":0},{"$f":"AS117*AS7/60","v":0}]
[null,{"$f":"ProjectData!G41","v":0},null,9,24,1,1.25,0,0,{"$f":"I118*G11","v":0},{"$f":"I118*G13","v":0},{"$f":"J118*'CTI Input Sheet'!B28","v":0},{"$f":"J118*'CTI Input Sheet'!C28","v":0},{"$f":"J118*'CTI Input Sheet'!D28","v":0},0,null,null,null,null,0,0,0,{"$f":"T118*'CTI Input Sheet'!K24","v":0},{"$f":"SUM(T118*H11)/60","v":0},null,0,0,0,0,0,0,null,{"$f":"SUM(AB118*AH8)+(AC118*AH9)","v":0},0,0,null,{"$f":"(B118*2)*AO6/60","v":0},{"$f":"AB118*AO8/60","v":0},0,0,{"$f":"AN118*AL6","v":0},null,{"$f":"IF(ProjectData!H$17=\"Not Required\",0,B118*2)","v":0},0,0,{"$f":"AQ118*0.88","v":0},{"$f":"AS118*AV7","v":0},{"$f":"AS118*AR7","v":0},{"$f":"AS118*AS7/60","v":0}]
[null,{"$f":"ProjectData!G42","v":0},null,9,36,1,1.25,0,0,{"$f":"I119*G11","v":0},{"$f":"I119*G13","v":0},{"$f":"J119*'CTI Input Sheet'!B28","v":0},{"$f":"J119*'CTI Input Sheet'!C28","v":0},{"$f":"J119*'CTI Input Sheet'!D28","v":0},0,null,null,null,null,0,0,0,{"$f":"T119*'CTI Input Sheet'!K24","v":0},{"$f":"SUM(T119*H11)/60","v":0},null,0,0,0,0,0,0,null,{"$f":"SUM(AB119*AH8)+(AC119*AH9)","v":0},0,0,null,{"$f":"(B119*2)*AO6/60","v":0},{"$f":"AB119*AO8/60","v":0},0,0,{"$f":"AN119*AL6","v":0},null,{"$f":"IF(ProjectData!H$17=\"Not Required\",0,B119*2)","v":0},0,0,{"$f":"AQ119*1.36","v":0},{"$f":"AS119*AV7","v":0},{"$f":"AS119*AR7","v":0},{"$f":"AS119*AS7/60","v":0}]
[null,{"$f":"ProjectData!G43","v":4},null,12,12,1,1.5,0,6,{"$f":"I120*G11","v":22.799999999999997},{"$f":"I120*G13","v":136.80000000000001},{"$f":"J120*'CTI Input Sheet'!B28","v":34.199999999999996},{"$f":"J120*'CTI Input Sheet'!C28","v":5.6999999999999993},{"$f":"J120*'CTI Input Sheet'!D28","v":0},39.899999999999991,null,null,null,null,4,22.799999999999997,39.899999999999991,{"$f":"T120*'CTI Input Sheet'!K24","v":6},{"$f":"SUM(T120*H11)/60","v":1},null,0,0,4,16,0,0,null,{"$f":"SUM(AB120*AH8)+(AC120*AH9)","v":44},0,44,null,{"$f":"(B120*2)*AO6/60","v":0.13333333333333333},{"$f":"AB120*AO8/60","v":0.13333333333333333},0,0.26666666666666666,{"$f":"AN120*AL6","v":20},null,{"$f":"IF(ProjectData!H$17=\"Not Required\",0,B120*2)","v":0},0,0,{"$f":"AQ120*0.53","v":0},{"$f":"AS120*AV8","v":0},{"$f":"AS120*AR8","v":0},{"$f":"AS120*AS8/60","v":0}]
[null,{"$f":"ProjectData!G44","v":0},null,12,24,1,1.5,0,0,{"$f":"I121*G11","v":0},{"$f":"I121*G13","v":0},{"$f":"J121*'CTI Input Sheet'!B28","v":0},{"$f":"J121*'CTI Input Sheet'!C28","v":0},{"$f":"J121*'CTI Input Sheet'!D28","v":0},0,null,null,null,null,0,0,0,{"$f":"T121*'CTI Input Sheet'!K24","v":0},{"$f":"SUM(T121*H11)/60","v":0},null,0,0,0,0,0,0,null,{"$f":"SUM(AB121*AH8)+(AC121*AH9)","v":0},0,0,null,{"$f":"(B121*2)*AO6/60","v":0},{"$f":"AB121*AO8/60","v":0},0,0,{"$f":"AN121*AL6","v":0},null,{"$f":"IF(ProjectData!H$17=\"Not Required\",0,B121*2)","v":0},0,0,{"$f":"AQ121*1.14","v":0},{"$f":"AS121*AV8","v":0},{"$f":"AS121*AR8","v":0},{"$f":"AS121*AS8/60","v":0}]
[null,{"$f":"ProjectData!G45","v":0},null,12,36,1,1.5,0,0,{"$f":"I122*G11","v":0},{"$f":"I122*G13","v":0},{"$f":"J122*'CTI Input Sheet'!B28","v":0},{"$f":"J122*'CTI Input Sheet'!C28","v":0},{"$f":"J122*'CTI Input Sheet'!D28","v":0},0,null,null,null,null,0,0,0,{"$f":"T122*'CTI Input Sheet'!K24","v":0},{"$f":"SUM(T122*H11)/60","v":0},null,0,0,0,0,0,0,null,{"$f":"SUM(AB122*AH8)+(AC122*AH9)","v":0},0,0,null,{"$f":"(B122*2)*AO6/60","v":0},{"$f":"AB122*AO8/60","v":0},0,0,{"$f":"AN122*AL6","v":0},null,{"$f":"IF(ProjectData!H$17=\"Not Required\",0,B122*2)","v":0},0,0,{"$f":"AQ122*1.75","v":0},{"$f":"AS122*AV8","v":0},{"$f":"AS122*AR8","v":0},{"$f":"AS122*AS8/60","v":0}]
[null,{"$f":"ProjectData!G46","v":0},null,18,12,1,2,0,0,{"$f":"I123*G11","v":0},{"$f":"I123*G13","v":0},{"$f":"J123*'CTI Input Sheet'!B28","v":0},{"$f":"J123*'CTI Input Sheet'!C28","v":0},{"$f":"J123*'CTI Input Sheet'!D28","v":0},0,null,null,null,null,0,0,0,{"$f":"T123*'CTI Input Sheet'!K24","v":0},{"$f":"SUM(T123*H11)/60","v":0},null,0,0,0,0,0,0,null,{"$f":"SUM(AB123*AH8)+(AC123*AH9)","v":0},0,0,null,{"$f":"(B123*2)*AO6/60","v":0},{"$f":"AB123*AO8/60","v":0},0,0,{"$f":"AN123*AL6","v":0},null,{"$f":"IF(ProjectData!H$17=\"Not Required\",0,B123*2)","v":0},0,0,{"$f":"AQ123*0.76","v":0},{"$f":"AS123*AV9","v":0},{"$f":"AS123*AR9","v":0},{"$f":"AS123*AS9/60","v":0}]
[null,{"$f":"ProjectData!G47","v":0},null,18,24,1,2,0,0,{"$f":"I124*G11","v":0},{"$f":"I124*G13","v":0},{"$f":"J124*'CTI Input Sheet'!B28","v":0},{"$f":"J124*'CTI Input Sheet'!C28","v":0},{"$f":"J124*'CTI Input Sheet'!D28","v":0},0,null,null,null,null,0,0,0,{"$f":"T124*'CTI Input Sheet'!K24","v":0},{"$f":"SUM(T124*H11)/60","v":0},null,0,0,0,0,0,0,null,{"$f":"SUM(AB124*AH8)+(AC124*AH9)","v":0},0,0,null,{"$f":"(B124*2)*AO6/60","v":0},{"$f":"AB124*AO8/60","v":0},0,0,{"$f":"AN124*AL6","v":0},null,{"$f":"IF(ProjectData!H$17=\"Not Required\",0,B124*2)","v":0},0,0,{"$f":"AQ124*1.65","v":0},{"$f":"AS124*AV9","v":0},{"$f":"AS124*AR9","v":0},{"$f":"AS124*AS9/60","v":0}]
[null,{"$f":"ProjectData!G48","v":0},null,18,36,1,2,0,0,{"$f":"I125*G11","v":0},{"$f":"I125*G13","v":0},{"$f":"J125*'CTI Input Sheet'!B28","v":0},{"$f":"J125*'CTI Input Sheet'!C28","v":0},{"$f":"J125*'CTI Input Sheet'!D28","v":0},0,null,null,null,null,0,0,0,{"$f":"T125*'CTI Input Sheet'!K24","v":0},{"$f":"SUM(T125*H11)/60","v":0},null,0,0,0,0,0,0,null,{"$f":"SUM(AB125*AH8)+(AC125*AH9)","v":0},0,0,null,{"$f":"(B125*2)*AO6/60","v":0},{"$f":"AB125*AO8/60","v":0},0,0,{"$f":"AN125*AL6","v":0},null,{"$f":"IF(ProjectData!H$17=\"Not Required\",0,B125*2)","v":0},0,0,{"$f":"AQ125*2.54","v":0},{"$f":"AS125*AV9","v":0},{"$f":"AS125*AR9","v":0},{"$f":"AS125*AS9/60","v":0}]
[null,{"$f":"ProjectData!G49","v":0},null,24,12,1,2.5,0,0,{"$f":"I126*G11","v":0},{"$f":"I126*G13","v":0},{"$f":"J126*'CTI Input Sheet'!B28","v":0},{"$f":"J126*'CTI Input Sheet'!C28","v":0},{"$f":"J126*'CTI Input Sheet'!D28","v":0},0,null,null,null,null,0,0,0,{"$f":"T126*'CTI Input Sheet'!K24","v":0},{"$f":"SUM(T126*H11)/60","v":0},null,0,0,0,0,0,0,null,{"$f":"SUM(AB126*AH8)+(AC126*AH9)","v":0},0,0,null,{"$f":"(B126*2)*AO6/60","v":0},{"$f":"AB126*AO8/60","v":0},0,0,{"$f":"AN126*AL6","v":0},null,{"$f":"IF(ProjectData!H$17=\"Not Required\",0,B126*2)","v":0},0,{"$f":"AQ126*6","v":0},{"$f":"AQ126*1","v":0},{"$f":"AS126*AV10","v":0},{"$f":"AS126*AR10","v":0},{"$f":"AS126*AS10/60","v":0}]
[null,{"$f":"ProjectData!G50","v":0},null,24,24,1,2.5,0,0,{"$f":"I127*G11","v":0},{"$f":"I127*G13","v":0},{"$f":"J127*'CTI Input Sheet'!B28","v":0},{"$f":"J127*'CTI Input Sheet'!C28","v":0},{"$f":"J127*'CTI Input Sheet'!D28","v":0},0,null,null,null,null,0,0,0,{"$f":"T127*'CTI Input Sheet'!K24","v":0},{"$f":"SUM(T127*H11)/60","v":0},null,0,0,0,0,0,0,null,{"$f":"SUM(AB127*AH8)+(AC127*AH9)","v":0},0,0,null,{"$f":"(B127*2)*AO6/60","v":0},{"$f":"AB127*AO8/60","v":0},0,0,{"$f":"AN127*AL6","v":0},null,{"$f":"IF(ProjectData!H$17=\"Not Required\",0,B127*2)","v":0},0,0,{"$f":"AQ127*2.16","v":0},{"$f":"AS127*AV10","v":0},{"$f":"AS127*AR10","v":0},{"$f":"AS127*AS10/60","v":0}]
[null,{"$f":"ProjectData!G51","v":0},null,24,36,1,2.5,0,0,{"$f":"I128*G11","v":0},{"$f":"I128*G13","v":0},{"$f":"J128*'CTI Input Sheet'!B28","v":0},{"$f":"J128*'CTI Input Sheet'!C28","v":0},{"$f":"J128*'CTI Input Sheet'!D28","v":0},0,null,null,null,null,0,0,0,{"$f":"T128*'CTI Input Sheet'!K24","v":0},{"$f":"SUM(T128*H11)/60","v":0},null,0,0,0,0,0,0,null,{"$f":"SUM(AB128*AH8)+(AC128*AH9)","v":0},0,0,null,{"$f":"(B128*2)*AO6/60","v":0},{"$f":"AB128*AO8/60","v":0},0,0,{"$f":"AN128*AL6","v":0},null,{"$f":"IF(ProjectData!H$17=\"Not Required\",0,B128*2)","v":0},0,0,{"$f":"AQ128*3.33","v":0},{"$f":"AS128*AV10","v":0},{"$f":"AS128*AR10","v":0},{"$f":"AS128*AS10/60","v":0}]
[null,{"$f":"ProjectData!G52","v":0},null,30,12,1,3,0,0,{"$f":"I129*G11","v":0},{"$f":"I129*G13","v":0},{"$f":"J129*'CTI Input Sheet'!B28","v":0},{"$f":"J129*'CTI Input Sheet'!C28","v":0},{"$f":"J129*'CTI Input Sheet'!D28","v":0},0,null,null,null,null,0,0,0,{"$f":"T129*'CTI Input Sheet'!K24","v":0},{"$f":"SUM(T129*H11)/60","v":0},null,0,0,0,0,0,0,null,{"$f":"SUM(AB129*AH8)+(AC129*AH9)","v":0},0,0,null,{"$f":"(B129*2)*AO6/60","v":0},{"$f":"AB129*AO8/60","v":0},0,0,{"$f":"AN129*AL6","v":0},null,{"$f":"IF(ProjectData!H$17=\"Not Required\",0,B129*2)","v":0},0,0,{"$f":"AQ129*1.23","v":0},{"$f":"AS129*AV11","v":0},{"$f":"AS129*AR11","v":0},{"$f":"AS129*AS11/60","v":0}]
[null,{"$f":"ProjectData!G53","v":0},null,30,24,1,3,0,0,{"$f":"I130*G11","v":0},{"$f":"I130*G13","v":0},{"$f":"J130*'CTI Input Sheet'!B28","v":0},{"$f":"J130*'CTI Input Sheet'!C28","v":0},{"$f":"J130*'CTI Input Sheet'!D28","v":0},0,null,null,null,null,0,0,0,{"$f":"T130*'CTI Input Sheet'!K24","v":0},{"$f":"SUM(T130*H11)/60","v":0},null,0,0,0,0,0,0,null,{"$f":"SUM(AB130*AH8)+(AC130*AH9)","v":0},0,0,null,{"$f":"(B130*2)*AO6/60","v":0},{"$f":"AB130*AO8/60","v":0},0,0,{"$f":"AN130*AL6","v":0},null,{"$f":"IF(ProjectData!H$17=\"Not Required\",0,B130*2)","v":0},0,0,{"$f":"AQ130*2.67","v":0},{"$f":"AS130*AV11","v":0},{"$f":"AS130*AR11","v":0},{"$f":"AS130*AS11/60","v":0}]
[null,{"$f":"ProjectData!G54","v":0},null,30,36,1,3,0,0,{"$f":"I131*G11","v":0},{"$f":"I131*G13","v":0},{"$f":"J131*'CTI Input Sheet'!B28","v":0},{"$f":"J131*'CTI Input Sheet'!C28","v":0},{"$f":"J131*'CTI Input Sheet'!D28","v":0},0,null,null,null,null,0,0,0,{"$f":"T131*'CTI Input Sheet'!K24","v":0},{"$f":"SUM(T131*H11)/60","v":0},null,0,0,0,0,0,0,null,{"$f":"SUM(AB131*AH8)+(AC131*AH9)","v":0},0,0,null,{"$f":"(B131*2)*AO6/60","v":0},{"$f":"AB131*AO8/60","v":0},0,0,{"$f":"AN131*AL6","v":0},null,{"$f":"IF(ProjectData!H$17=\"Not Required\",0,B131*2)","v":0},0,0,{"$f":"AQ131*4.12","v":0},{"$f":"AS131*AV11","v":0},{"$f":"AS131*AR11","v":0},{"$f":"AS131*AS11/60","v":0}]
[null,{"$f":"ProjectData!G55","v":2},null,36,12,1,3.5,0,7,{"$f":"I132*G11","v":26.599999999999998},{"$f":"I132*G13","v":159.6},{"$f":"J132*'CTI Input Sheet'!B28","v":39.9},{"$f":"J132*'CTI Input Sheet'!C28","v":6.6499999999999995},{"$f":"J132*'CTI Input Sheet'!D28","v":0},46.55,null,null,null,null,2,26.599999999999998,46.55,{"$f":"T132*'CTI Input Sheet'!K24","v":3},{"$f":"SUM(T132*H11)/60","v":0.5},null,0,0,2,8,0,0,null,{"$f":"SUM(AB132*AH8)+(AC132*AH9)","v":22},0,22,null,{"$f":"(B132*2)*AO6/60","v":6.6666666666666666E-2},{"$f":"AB132*AO8/60","v":6.6666666666666666E-2},0,0.13333333333333333,{"$f":"AN132*AL6","v":10},null,{"$f":"IF(ProjectData!H$17=\"Not Required\",0,B132*2)","v":0},0,0,{"$f":"AQ132*1.47","v":0},{"$f":"AS132*AV12","v":0},{"$f":"AS132*AR12","v":0},{"$f":"AS132*AS12/60","v":0}]
[null,{"$f":"ProjectData!G56","v":0},null,36,24,1,3.5,0,0,{"$f":"I133*G11","v":0},{"$f":"I133*G13","v":0},{"$f":"J133*'CTI Input Sheet'!B28","v":0},{"$f":"J133*'CTI Input Sheet'!C28","v":0},{"$f":"J133*'CTI Input Sheet'!D28","v":0},0,null,null,null,null,0,0,0,{"$f":"T133*'CTI Input Sheet'!K24","v":0},{"$f":"SUM(T133*H11)/60","v":0},null,0,0,0,0,0,0,null,{"$f":"SUM(AB133*AH8)+(AC133*AH9)","v":0},0,0,null,{"$f":"(B133*2)*AO6/60","v":0},{"$f":"AB133*AO8/60","v":0},0,0,{"$f":"AN133*AL6","v":0},null,{"$f":"IF(ProjectData!H$17=\"Not Required\",0,B133*2)","v":0},0,0,{"$f":"AQ133*3.19","v":0},{"$f":"AS133*AV12","v":0},{"$f":"AS133*AR12","v":0},{"$f":"AS133*AS12/60","v":0}]
[null,{"$f":"ProjectData!G57","v":0},null,36,36,1,3.5,0,0,{"$f":"I134*G11","v":0},{"$f":"I134*G13","v":0},{"$f":"J134*'CTI Input Sheet'!B28","v":0},{"$f":"J134*'CTI Input Sheet'!C28","v":0},{"$f":"J134*'CTI Input Sheet'!D28","v":0},{"$f":"SUM(L134:N134)","v":0},null,null,null,null,0,0,0,{"$f":"T134*'CTI Input Sheet'!K24","v":0},{"$f":"SUM(T134*H11)/60","v":0},null,0,0,0,0,0,0,null,{"$f":"SUM(AB134*AH8)+(AC134*AH9)","v":0},0,0,null,{"$f":"(B134*2)*AO6/60","v":0},{"$f":"AB134*AO8/60","v":0},0,0,{"$f":"AN134*AL6","v":0},null,{"$f":"IF(ProjectData!H$17=\"Not Required\",0,B134*2)","v":0},0,0,{"$f":"AQ134*4.9","v":0},{"$f":"AS134*AV12","v":0},{"$f":"AS134*AR12","v":0},{"$f":"AS134*AS12/60","v":0}]
[null,{"$f":"SUM(B114:B134)","v":6},null,null,null,null,null,null,{"$f":"SUM(I114:I134)","v":13},49.399999999999991,296.39999999999998,74.099999999999994,12.349999999999998,0,86.449999999999989,null,null,null,null,{"$f":"SUM(T114:T134)","v":6},{"$f":"SUM(U114:U134)","v":49.399999999999991},{"$f":"SUM(V114:V134)","v":86.449999999999989},{"$f":"SUM(W114:W134)","v":9},{"$f":"SUM(X114:X134)","v":1.5},null,{"$f":"SUM(Z114:Z134)","v":0},0,6,24,0,0,null,{"$f":"SUM(AG114:AG134)","v":66},{"$f":"SUM(AH114:AH134)","v":0},{"$f":"SUM(AI114:AI134)","v":66},null,{"$f":"SUM(AK114:AK134)","v":0.2},{"$f":"SUM(AL114:AL134)","v":0.2},{"$f":"SUM(AM114:AM134)","v":0},{"$f":"SUM(AN114:AN134)","v":0.4},{"$f":"SUM(AO114:AO134)","v":30},null,{"$f":"SUM(AQ114:AQ134)","v":0},0,0,0,0,0,0]
[null,null,null,null,null,null,null,null,null,null,null,null,null,null,null,null,null,null,null,null,null,null,{"$f":"W135*'CTI Input Sheet'!H7","v":675},{"$f":"X135*'CTI Input Sheet'!H6","v":112.5},null,null,{"$f":"AA135*AH12","v":0},{"$f":"AB135*AH8","v":36},{"$f":"AC135*AH9","v":30},{"$f":"AD135*AH10","v":0},{"$f":"AE135*AH11","v":0},null,null,null,null,null,{"$f":"AK135*AL6","v":15},{"$f":"AL135*AL6","v":15},{"$f":"AM135*AL6","v":0}]
[null,"Vertical VO Fittings",null,"Vertical VO Fittings",null,"TSS : Vertical VO Support Quantity - Support Weight - Support Steel, Fabrication, Logistics, Erection Costs",null,null,null,null,null,null,null,null,null,null,null,null,null,"VO : Support Structure Summary",null,null,null,null,null,"VO : Tray Accessory Quantities ",null,null,null,null,null,null,"VO : Tray Accessory Costs ",null,null,null,"VO : Tray Accessory Installation Time & Installation Cost",null,null,null,null,null,"VO Covers"]
[null,"Quantities",null,"HB Width (in)","HB Radius (in) ","Support Quantity","OS1 Str. Section Length (FT)","OS2 Str. Section Length (FT)","Total Str. Section Length (FT)","Total Str. Section Weight (LBS)","Total Str. Section Cost (USD)","Total Fabrication Cost (USD)","Total Logistic Cost (USD)","Total Erection Cost (USD","SUM TOTAL COST/FITTING",null,null,null,null,"Total Quantity of Supports","Total Weight of Supports (LB)","Total Cost of Supports (USD)","Total Design Time (HOURS)","Total Support Instal Time (HOURS)",null,"Integral Link Quantity (PAIRS)","Integral ink Hardware Quantity (PCS)","Hold Down Clamp Quantity (PR)","Clamp Hardware Quantity (PCS)","Expansion Guides Quantity (PR)","Guides Hardware Quantity (PCS)",null,"Hold Down Clamps Cost/Pair (USD)","Exp. Guides Cost/Pair (USD)","Total Accessory Cost (USD)",null,"TOUGHLink Time/Pair (HRS)","Hold Down Clamp Time/Pair (HRS)","Exp. Guide Time/Pair (HRS)","Total Time (HOURS)","Total Time Cost (USD)",null,"Cover Quantity (PCS)","Clamp Quantity (PCS)","TOUGHTorx Quantity (PCS)","Cover Weight (LBS)","TOUGHTorx Weight (LBS)","Clamps Cost (USD)","Installation Time (HOURS)"]
[null,{"$f":"ProjectData!J37","v":0},null,6,12,1,1,0,{"$f":"SUM(G139+H139)*B139","v":0},{"$f":"I139*G11","v":0},{"$f":"I139*G13","v":0},{"$f":"J139*'CTI Input Sheet'!B28","v":0},{"$f":"J139*'CTI Input Sheet'!C28","v":0},{"$f":"J139*'CTI Input Sheet'!D28","v":0},{"$f":"SUM(L139:N139)","v":0},null,null,null,null,{"$f":"B139*F139","v":0},{"$f":"J139","v":0},{"$f":"O139","v":0},{"$f":"T139*'CTI Input Sheet'!K24","v":0},{"$f":"SUM(T139*H11)/60","v":0},null,0,{"$f":"Z139*8","v":0},{"$f":"(F139)*B139","v":0},{"$f":"AB139*4","v":0},0,0,null,{"$f":"SUM(AB139*AH8)+(AC139*AH9)","v":0},0,{"$f":"SUM(AG139:AH139)","v":0},null,{"$f":"(B139*2)*AO6/60","v":0},{"$f":"AB139*AO8/60","v":0},0,{"$f":"SUM(AK139:AM139)","v":0},{"$f":"AN139*AL6","v":0},null,{"$f":"IF(ProjectData!H$17=\"Not Required\",0,B139*2)","v":0},{"$f":"AQ139*0","v":0},{"$f":"AQ139*4","v":0},{"$f":"AQ139*0.55","v":0},{"$f":"AS139*AV6","v":0},{"$f":"AS139*AR6","v":0},{"$f":"AS139*AS6/60","v":0}]
[null,{"$f":"ProjectData!J38","v":0},null,6,24,1,1,0,0,{"$f":"I140*G11","v":0},{"$f":"I140*G13","v":0},{"$f":"J140*'CTI Input Sheet'!B28","v":0},{"$f":"J140*'CTI Input Sheet'!C28","v":0},{"$f":"J140*'CTI Input Sheet'!D28","v":0},0,null,null,null,null,0,0,0,{"$f":"T140*'CTI Input Sheet'!K24","v":0},{"$f":"SUM(T140*H11)/60","v":0},null,0,0,0,0,0,0,null,{"$f":"SUM(AB140*AH8)+(AC140*AH9)","v":0},0,0,null,{"$f":"(B140*2)*AO6/60","v":0},{"$f":"AB140*AO8/60","v":0},0,0,{"$f":"AN140*AL6","v":0},null,{"$f":"IF(ProjectData!H$17=\"Not Required\",0,B140*2)","v":0},0,0,{"$f":"AQ140*0.89","v":0},{"$f":"AS140*AV6","v":0},{"$f":"AS140*AR6","v":0},{"$f":"AS140*AS6/60","v":0}]
[null,{"$f":"ProjectData!J39","v":0},null,6,36,1,1,0,0,{"$f":"I141*G11","v":0},{"$f":"I141*G13","v":0},{"$f":"J141*'CTI Input Sheet'!B28","v":0},{"$f":"J141*'CTI Input Sheet'!C28","v":0},{"$f":"J141*'CTI Input Sheet'!D28","v":0},0,null,null,null,null,0,0,0,{"$f":"T141*'CTI Input Sheet'!K24","v":0},{"$f":"SUM(T141*H11)/60","v":0},null,0,0,0,0,0,0,null,{"$f":"SUM(AB141*AH8)+(AC141*AH9)","v":0},0,0,null,{"$f":"(B141*2)*AO6/60","v":0},{"$f":"AB141*AO8/60","v":0},0,0,{"$f":"AN141*AL6","v":0},null,{"$f":"IF(ProjectData!H$17=\"Not Required\",0,B141*2)","v":0},0,0,{"$f":"AQ141*1.23","v":0},{"$f":"AS141*AV6","v":0},{"$f":"AS141*AR6","v":0},{"$f":"AS141*AS6/60","v":0}]
[null,{"$f":"ProjectData!J40","v":0},null,9,12,1,1.25,0,0,{"$f":"I142*G11","v":0},{"$f":"I142*G13","v":0},{"$f":"J142*'CTI Input Sheet'!B28","v":0},{"$f":"J142*'CTI Input Sheet'!C28","v":0},{"$f":"J142*'CTI Input Sheet'!D28","v":0},0,null,null,null,null,0,0,0,{"$f":"T142*'CTI Input Sheet'!K24","v":0},{"$f":"SUM(T142*H11)/60","v":0},null,0,0,0,0,0,0,null,{"$f":"SUM(AB142*AH8)+(AC142*AH9)","v":0},0,0,null,{"$f":"(B142*2)*AO6/60","v":0},{"$f":"AB142*AO8/60","v":0},0,0,{"$f":"AN142*AL6","v":0},null,{"$f":"IF(ProjectData!H$17=\"Not Required\",0,B142*2)","v":0},0,0,{"$f":"AQ142*0.77","v":0},{"$f":"AS142*AV7","v":0},{"$f":"AS142*AR7","v":0},{"$f":"AS142*AS7/60","v":0}]
[null,{"$f":"ProjectData!J41","v":0},null,9,24,1,1.25,0,0,{"$f":"I143*G11","v":0},{"$f":"I143*G13","v":0},{"$f":"J143*'CTI Input Sheet'!B28","v":0},{"$f":"J143*'CTI Input Sheet'!C28","v":0},{"$f":"J143*'CTI Input Sheet'!D28","v":0},0,null,null,null,null,0,0,0,{"$f":"T143*'CTI Input Sheet'!K24","v":0},{"$f":"SUM(T143*H11)/60","v":0},null,0,0,0,0,0,0,null,{"$f":"SUM(AB143*AH8)+(AC143*AH9)","v":0},0,0,null,{"$f":"(B143*2)*AO6/60","v":0},{"$f":"AB143*AO8/60","v":0},0,0,{"$f":"AN143*AL6","v":0},null,{"$f":"IF(ProjectData!H$17=\"Not Required\",0,B143*2)","v":0},0,0,{"$f":"AQ143*1.25","v":0},{"$f":"AS143*AV7","v":0},{"$f":"AS143*AR7","v":0},{"$f":"AS143*AS7/60","v":0}]
[null,{"$f":"ProjectData!J42","v":0},null,9,36,1,1.25,0,0,{"$f":"I144*G11","v":0},{"$f":"I144*G13","v":0},{"$f":"J144*'CTI Input Sheet'!B28","v":0},{"$f":"J144*'CTI Input Sheet'!C28","v":0},{"$f":"J144*'CTI Input Sheet'!D28","v":0},0,null,null,null,null,0,0,0,{"$f":"T144*'CTI Input Sheet'!K24","v":0},{"$f":"SUM(T144*H11)/60","v":0},null,0,0,0,0,0,0,null,{"$f":"SUM(AB144*AH8)+(AC144*AH9)","v":0},0,0,null,{"$f":"(B144*2)*AO6/60","v":0},{"$f":"AB144*AO8/60","v":0},0,0,{"$f":"AN144*AL6","v":0},null,{"$f":"IF(ProjectData!H$17=\"Not Required\",0,B144*2)","v":0},0,0,{"$f":"AQ144*1.72","v":0},{"$f":"AS144*AV7","v":0},{"$f":"AS144*AR7","v":0},{"$f":"AS144*AS7/60","v":0}]
[null,{"$f":"ProjectData!J43","v":4},null,12,12,1,1.5,0,6,{"$f":"I145*G11","v":22.799999999999997},{"$f":"I145*G13","v":136.80000000000001},{"$f":"J145*'CTI Input Sheet'!B28","v":34.199999999999996},{"$f":"J145*'CTI Input Sheet'!C28","v":5.6999999999999993},{"$f":"J145*'CTI Input Sheet'!D28","v":0},{"$f":"SUM(L145:N145)","v":39.899999999999991},null,null,null,null,4,22.799999999999997,39.899999999999991,{"$f":"T145*'CTI Input Sheet'!K24","v":6},{"$f":"SUM(T145*H11)/60","v":1},null,0,0,4,16,0,0,null,{"$f":"SUM(AB145*AH8)+(AC145*AH9)","v":44},0,44,null,{"$f":"(B145*2)*AO6/60","v":0.13333333333333333},{"$f":"AB145*AO8/60","v":0.13333333333333333},0,0.26666666666666666,{"$f":"AN145*AL6","v":20},null,{"$f":"IF(ProjectData!H$17=\"Not Required\",0,B145*2)","v":0},0,0,{"$f":"AQ145*0.99","v":0},{"$f":"AS145*AV8","v":0},{"$f":"AS145*AR8","v":0},{"$f":"AS145*AS8/60","v":0}]
[null,{"$f":"ProjectData!J44","v":0},null,12,24,1,1.5,0,0,{"$f":"I146*G11","v":0},{"$f":"I146*G13","v":0},{"$f":"J146*'CTI Input Sheet'!B28","v":0},{"$f":"J146*'CTI Input Sheet'!C28","v":0},{"$f":"J146*'CTI Input Sheet'!D28","v":0},0,null,null,null,null,0,0,0,{"$f":"T146*'CTI Input Sheet'!K24","v":0},{"$f":"SUM(T146*H11)/60","v":0},null,0,0,0,0,0,0,null,{"$f":"SUM(AB146*AH8)+(AC146*AH9)","v":0},0,0,null,{"$f":"(B146*2)*AO6/60","v":0},{"$f":"AB146*AO8/60","v":0},0,0,{"$f":"AN146*AL6","v":0},null,{"$f":"IF(ProjectData!H$17=\"Not Required\",0,B146*2)","v":0},0,0,{"$f":"AQ146*1.61","v":0},{"$f":"AS146*AV8","v":0},{"$f":"AS146*AR8","v":0},{"$f":"AS146*AS8/60","v":0}]
[null,{"$f":"ProjectData!J45","v":0},null,12,36,1,1.5,0,0,{"$f":"I147*G11","v":0},{"$f":"I147*G13","v":0},{"$f":"J147*'CTI Input Sheet'!B28","v":0},{"$f":"J147*'CTI Input Sheet'!C28","v":0},{"$f":"J147*'CTI Input Sheet'!D28","v":0},0,null,null,null,null,0,0,0,{"$f":"T147*'CTI Input Sheet'!K24","v":0},{"$f":"SUM(T147*H11)/60","v":0},null,0,0,0,0,0,0,null,{"$f":"SUM(AB147*AH8)+(AC147*AH9)","v":0},0,0,null,{"$f":"(B147*2)*AO6/60","v":0},{"$f":"AB147*AO8/60","v":0},0,0,{"$f":"AN147*AL6","v":0},null,{"$f":"IF(ProjectData!H$17=\"Not Required\",0,B147*2)","v":0},0,0,{"$f":"AQ147*2.22","v":0},{"$f":"AS147*AV8","v":0},{"$f":"AS147*AR8","v":0},{"$f":"AS147*AS8/60","v":0}]
[null,{"$f":"ProjectData!J46","v":0},null,18,12,1,2,0,0,{"$f":"I148*G11","v":0},{"$f":"I148*G13","v":0},{"$f":"J148*'CTI Input Sheet'!B28","v":0},{"$f":"J148*'CTI Input Sheet'!C28","v":0},{"$f":"J148*'CTI Input Sheet'!D28","v":0},0,null,null,null,null,0,0,0,{"$f":"T148*'CTI Input Sheet'!K24","v":0},{"$f":"SUM(T148*H11)/60","v":0},null,0,0,0,0,0,0,null,{"$f":"SUM(AB148*AH8)+(AC148*AH9)","v":0},0,0,null,{"$f":"(B148*2)*AO6/60","v":0},{"$f":"AB148*AO8/60","v":0},0,0,{"$f":"AN148*AL6","v":0},null,{"$f":"IF(ProjectData!H$17=\"Not Required\",0,B148*2)","v":0},0,0,{"$f":"AQ148*1.44","v":0},{"$f":"AS148*AV9","v":0},{"$f":"AS148*AR9","v":0},{"$f":"AS148*AS9/60","v":0}]
[null,{"$f":"ProjectData!J47","v":0},null,18,24,1,2,0,0,{"$f":"I149*G11","v":0},{"$f":"I149*G13","v":0},{"$f":"J149*'CTI Input Sheet'!B28","v":0},{"$f":"J149*'CTI Input Sheet'!C28","v":0},{"$f":"J149*'CTI Input Sheet'!D28","v":0},0,null,null,null,null,0,0,0,{"$f":"T149*'CTI Input Sheet'!K24","v":0},{"$f":"SUM(T149*H11)/60","v":0},null,0,0,0,0,0,0,null,{"$f":"SUM(AB149*AH8)+(AC149*AH9)","v":0},0,0,null,{"$f":"(B149*2)*AO6/60","v":0},{"$f":"AB149*AO8/60","v":0},0,0,{"$f":"AN149*AL6","v":0},null,{"$f":"IF(ProjectData!H$17=\"Not Required\",0,B149*2)","v":0},0,0,{"$f":"AQ149*2.33","v":0},{"$f":"AS149*AV9","v":0},{"$f":"AS149*AR9","v":0},{"$f":"AS149*AS9/60","v":0}]
[null,{"$f":"ProjectData!J48","v":0},null,18,36,1,2,0,0,{"$f":"I150*G11","v":0},{"$f":"I150*G13","v":0},{"$f":"J150*'CTI Input Sheet'!B28","v":0},{"$f":"J150*'CTI Input Sheet'!C28","v":0},{"$f":"J150*'CTI Input Sheet'!D28","v":0},0,null,null,null,null,0,0,0,{"$f":"T150*'CTI Input Sheet'!K24","v":0},{"$f":"SUM(T150*H11)/60","v":0},null,0,0,0,0,0,0,null,{"$f":"SUM(AB150*AH8)+(AC150*AH9)","v":0},0,0,null,{"$f":"(B150*2)*AO6/60","v":0},{"$f":"AB150*AO8/60","v":0},0,0,{"$f":"AN150*AL6","v":0},null,{"$f":"IF(ProjectData!H$17=\"Not Required\",0,B150*2)","v":0},0,0,{"$f":"AQ150*3.22","v":0},{"$f":"AS150*AV9","v":0},{"$f":"AS150*AR9","v":0},{"$f":"AS150*AS9/60","v":0}]
[null,{"$f":"ProjectData!J49","v":0},null,24,12,1,2.5,0,0,{"$f":"I151*G11","v":0},{"$f":"I151*G13","v":0},{"$f":"J151*'CTI Input Sheet'!B28","v":0},{"$f":"J151*'CTI Input Sheet'!C28","v":0},{"$f":"J151*'CTI Input Sheet'!D28","v":0},0,null,null,null,null,0,0,0,{"$f":"T151*'CTI Input Sheet'!K24","v":0},{"$f":"SUM(T151*H11)/60","v":0},null,0,0,0,0,0,0,null,{"$f":"SUM(AB151*AH8)+(AC151*AH9)","v":0},0,0,null,{"$f":"(B151*2)*AO6/60","v":0},{"$f":"AB151*AO8/60","v":0},0,0,{"$f":"AN151*AL6","v":0},null,{"$f":"IF(ProjectData!H$17=\"Not Required\",0,B151*2)","v":0},0,{"$f":"AQ151*6","v":0},{"$f":"AQ151*1.89","v":0},{"$f":"AS151*AV10","v":0},{"$f":"AS151*AR10","v":0},{"$f":"AS151*AS10/60","v":0}]
[null,{"$f":"ProjectData!J50","v":0},null,24,24,1,2.5,0,0,{"$f":"I152*G11","v":0},{"$f":"I152*G13","v":0},{"$f":"J152*'CTI Input Sheet'!B28","v":0},{"$f":"J152*'CTI Input Sheet'!C28","v":0},{"$f":"J152*'CTI Input Sheet'!D28","v":0},0,null,null,null,null,0,0,0,{"$f":"T152*'CTI Input Sheet'!K24","v":0},{"$f":"SUM(T152*H11)/60","v":0},null,0,0,0,0,0,0,null,{"$f":"SUM(AB152*AH8)+(AC152*AH9)","v":0},0,0,null,{"$f":"(B152*2)*AO6/60","v":0},{"$f":"AB152*AO8/60","v":0},0,0,{"$f":"AN152*AL6","v":0},null,{"$f":"IF(ProjectData!H$17=\"Not Required\",0,B152*2)","v":0},0,0,{"$f":"AQ152*3.05","v":0},{"$f":"AS152*AV10","v":0},{"$f":"AS152*AR10","v":0},{"$f":"AS152*AS10/60","v":0}]
[null,{"$f":"ProjectData!J51","v":0},null,24,36,1,2.5,0,0,{"$f":"I153*G11","v":0},{"$f":"I153*G13","v":0},{"$f":"J153*'CTI Input Sheet'!B28","v":0},{"$f":"J153*'CTI Input Sheet'!C28","v":0},{"$f":"J153*'CTI Input Sheet'!D28","v":0},0,null,null,null,null,0,0,0,{"$f":"T153*'CTI Input Sheet'!K24","v":0},{"$f":"SUM(T153*H11)/60","v":0},null,0,0,0,0,0,0,null,{"$f":"SUM(AB153*AH8)+(AC153*AH9)","v":0},0,0,null,{"$f":"(B153*2)*AO6/60","v":0},{"$f":"AB153*AO8/60","v":0},0,0,{"$f":"AN153*AL6","v":0},null,{"$f":"IF(ProjectData!H$17=\"Not Required\",0,B153*2)","v":0},0,0,{"$f":"AQ153*4.22","v":0},{"$f":"AS153*AV10","v":0},{"$f":"AS153*AR10","v":0},{"$f":"AS153*AS10/60","v":0}]
[null,{"$f":"ProjectData!J52","v":0},null,30,12,1,3,0,0,{"$f":"I154*G11","v":0},{"$f":"I154*G13","v":0},{"$f":"J154*'CTI Input Sheet'!B28","v":0},{"$f":"J154*'CTI Input Sheet'!C28","v":0},{"$f":"J154*'CTI Input Sheet'!D28","v":0},0,null,null,null,null,0,0,0,{"$f":"T154*'CTI Input Sheet'!K24","v":0},{"$f":"SUM(T154*H11)/60","v":0},null,0,0,0,0,0,0,null,{"$f":"SUM(AB154*AH8)+(AC154*AH9)","v":0},0,0,null,{"$f":"(B154*2)*AO6/60","v":0},{"$f":"AB154*AO8/60","v":0},0,0,{"$f":"AN154*AL6","v":0},null,{"$f":"IF(ProjectData!H$17=\"Not Required\",0,B154*2)","v":0},0,0,{"$f":"AQ154*2.33","v":0},{"$f":"AS154*AV11","v":0},{"$f":"AS154*AR11","v":0},{"$f":"AS154*AS11/60","v":0}]
[null,{"$f":"ProjectData!J53","v":0},null,30,24,1,3,0,0,{"$f":"I155*G11","v":0},{"$f":"I155*G13","v":0},{"$f":"J155*'CTI Input Sheet'!B28","v":0},{"$f":"J155*'CTI Input Sheet'!C28","v":0},{"$f":"J155*'CTI Input Sheet'!D28","v":0},0,null,null,null,null,0,0,0,{"$f":"T155*'CTI Input Sheet'!K24","v":0},{"$f":"SUM(T155*H11)/60","v":0},null,0,0,0,0,0,0,null,{"$f":"SUM(AB155*AH8)+(AC155*AH9)","v":0},0,0,null,{"$f":"(B155*2)*AO6/60","v":0},{"$f":"AB155*AO8/60","v":0},0,0,{"$f":"AN155*AL6","v":0},null,{"$f":"IF(ProjectData!H$17=\"Not Required\",0,B155*2)","v":0},0,0,{"$f":"AQ155*3.77","v":0},{"$f":"AS155*AV11","v":0},{"$f":"AS155*AR11","v":0},{"$f":"AS155*AS11/60","v":0}]
[null,{"$f":"ProjectData!J54","v":0},null,30,36,1,3,0,0,{"$f":"I156*G11","v":0},{"$f":"I156*G13","v":0},{"$f":"J156*'CTI Input Sheet'!B28","v":0},{"$f":"J156*'CTI Input Sheet'!C28","v":0},{"$f":"J156*'CTI Input Sheet'!D28","v":0},0,null,null,null,null,0,0,0,{"$f":"T156*'CTI Input Sheet'!K24","v":0},{"$f":"SUM(T156*H11)/60","v":0},null,0,0,0,0,0,0,null,{"$f":"SUM(AB156*AH8)+(AC156*AH9)","v":0},0,0,null,{"$f":"(B156*2)*AO6/60","v":0},{"$f":"AB156*AO8/60","v":0},0,0,{"$f":"AN156*AL6","v":0},null,{"$f":"IF(ProjectData!H$17=\"Not Required\",0,B156*2)","v":0},0,0,{"$f":"AQ156*5.21","v":0},{"$f":"AS156*AV11","v":0},{"$f":"AS156*AR11","v":0},{"$f":"AS156*AS11/60","v":0}]
[null,{"$f":"ProjectData!J55","v":0},null,36,12,1,3.5,0,0,{"$f":"I157*G11","v":0},{"$f":"I157*G13","v":0},{"$f":"J157*'CTI Input Sheet'!B28","v":0},{"$f":"J157*'CTI Input Sheet'!C28","v":0},{"$f":"J157*'CTI Input Sheet'!D28","v":0},0,null,null,null,null,0,0,0,{"$f":"T157*'CTI Input Sheet'!K24","v":0},{"$f":"SUM(T157*H11)/60","v":0},null,0,0,0,0,0,0,null,{"$f":"SUM(AB157*AH8)+(AC157*AH9)","v":0},0,0,null,{"$f":"(B157*2)*AO6/60","v":0},{"$f":"AB157*AO8/60","v":0},0,0,{"$f":"AN157*AL6","v":0},null,{"$f":"IF(ProjectData!H$17=\"Not Required\",0,B157*2)","v":0},0,0,{"$f":"AQ157*2.78","v":0},{"$f":"AS157*AV12","v":0},{"$f":"AS157*AR12","v":0},{"$f":"AS157*AS12/60","v":0}]
[null,{"$f":"ProjectData!J56","v":0},null,36,24,1,3.5,0,0,{"$f":"I158*G11","v":0},{"$f":"I158*G13","v":0},{"$f":"J158*'CTI Input Sheet'!B28","v":0},{"$f":"J158*'CTI Input Sheet'!C28","v":0},{"$f":"J158*'CTI Input Sheet'!D28","v":0},0,null,null,null,null,0,0,0,{"$f":"T158*'CTI Input Sheet'!K24","v":0},{"$f":"SUM(T158*H11)/60","v":0},null,0,0,0,0,0,0,null,{"$f":"SUM(AB158*AH8)+(AC158*AH9)","v":0},0,0,null,{"$f":"(B158*2)*AO6/60","v":0},{"$f":"AB158*AO8/60","v":0},0,0,{"$f":"AN158*AL6","v":0},null,{"$f":"IF(ProjectData!H$17=\"Not Required\",0,B158*2)","v":0},0,0,{"$f":"AQ158*4.49","v":0},{"$f":"AS158*AV12","v":0},{"$f":"AS158*AR12","v":0},{"$f":"AS158*AS12/60","v":0}]
[null,{"$f":"ProjectData!J57","v":2},null,36,36,1,3.5,0,7,{"$f":"I159*G11","v":26.599999999999998},{"$f":"I159*G13","v":159.6},{"$f":"J159*'CTI Input Sheet'!B28","v":39.9},{"$f":"J159*'CTI Input Sheet'!C28","v":6.6499999999999995},{"$f":"J159*'CTI Input Sheet'!D28","v":0},{"$f":"SUM(L159:N159)","v":46.55},null,null,null,null,2,26.599999999999998,46.55,{"$f":"T159*'CTI Input Sheet'!K24","v":3},{"$f":"SUM(T159*H11)/60","v":0.5},null,0,0,2,8,0,0,null,{"$f":"SUM(AB159*AH8)+(AC159*AH9)","v":22},0,22,null,{"$f":"(B159*2)*AO6/60","v":6.6666666666666666E-2},{"$f":"AB159*AO8/60","v":6.6666666666666666E-2},0,0.13333333333333333,{"$f":"AN159*AL6","v":10},null,{"$f":"IF(ProjectData!H$17=\"Not Required\",0,B159*2)","v":0},0,0,{"$f":"AQ159*6.21","v":0},{"$f":"AS159*AV12","v":0},{"$f":"AS159*AR12","v":0},{"$f":"AS159*AS12/60","v":0}]
[null,{"$f":"SUM(B139:B159)","v":6},null,null,null,null,null,null,{"$f":"SUM(I139:I159)","v":13},49.399999999999991,296.39999999999998,74.099999999999994,12.349999999999998,0,86.449999999999989,null,null,null,null,{"$f":"SUM(T139:T159)","v":6},{"$f":"SUM(U139:U159)","v":49.399999999999991},{"$f":"SUM(V139:V159)","v":86.449999999999989},{"$f":"SUM(W139:W159)","v":9},{"$f":"SUM(X139:X159)","v":1.5},null,{"$f":"SUM(Z139:Z159)","v":0},0,6,24,0,0,null,{"$f":"SUM(AG139:AG159)","v":66},{"$f":"SUM(AH139:AH159)","v":0},{"$f":"SUM(AI139:AI159)","v":66},null,{"$f":"SUM(AK139:AK159)","v":0.2},{"$f":"SUM(AL139:AL159)","v":0.2},{"$f":"SUM(AM139:AM159)","v":0},{"$f":"SUM(AN139:AN159)","v":0.4},{"$f":"SUM(AO139:AO159)","v":30},null,{"$f":"SUM(AQ139:AQ159)","v":0},0,0,0,0,0,0]
[null,null,null,null,null,null,null,null,null,null,null,null,null,null,null,null,null,null,null,null,null,null,{"$f":"W160*'CTI Input Sheet'!H7","v":675},{"$f":"X160*'CTI Input Sheet'!H6","v":112.5},null,null,{"$f":"AA160*AH12","v":0},{"$f":"AB160*AH8","v":36},{"$f":"AC160*AH9","v":30},{"$f":"AD160*AH10","v":0},{"$f":"AE160*AH11","v":0},null,null,null,null,null,{"$f":"AK160*AL6","v":15},{"$f":"AL160*AL6","v":15},{"$f":"AM160*AL6","v":0}]
[null,"4\" Expansion Kits",null,"Expansion Joints",null,"TSS : Expansion Joint Support Quantity - Support Weight - Support Steel, Fabrication, Logistics, Erection Costs",null,null,null,null,null,null,null,null,null,null,null,null,null,"4\" Expansion Joint : Support Structure Summary",null,null,null,null,null,"4\" Expansion Joint : Tray Accessory Quantities",null,null,null,null,null,null,"4\" Expansion Joint : Tray Accessory Costs ",null,null,null,"4\" Expansion Joint : Tray Accessory Installation Time & Installation Cost"]
[null,"Quantities",null,"Width (in)","Hieght (in) ","Support Quantity","OS1 Str. Section Length (FT)","OS2 Str. Section Length (FT)","Total Str. Section Length (FT)","Total Str. Section Weight (LBS)","Total Str. Section Cost (USD)","Total Fabrication Cost (USD)","Total Logistic Cost (USD)","Total Erection Cost (USD","SUM TOTAL COST/FITTING",null,null,null,null,"Total Quantity of Supports","Total Weight of Supports (LB)","Total Cost of Supports (USD)","Total Design Time (HOURS)","Total Support Instal Time (HOURS)",null,"Expansion Kit Quantity (PAIRS)","Cartridge Hardware Quantity (PCS)","Hold Down Clamp Quantity (PR)","Clamp Hardware Quantity (PCS)","Expansion Guides Quantity (PR)","Guides Hardware Quantity (PCS)",null,"Hold Down Clamps Cost/Pair (USD)","Expansion Guides Cost/Pair (USD)","Total Accessory Cost (USD)",null,"TOUGHLink Time/Pair (HRS)","Hold Down Clamp Time/Pair (HRS)","Exp. Guide Time/Pair (HRS)","Total Time (HOURS)","Total Time Cost (USD)"]
[null,{"$f":"P6","v":0},null,6,4,0,0,0,{"$f":"SUM(G164+H164)*B164","v":0},{"$f":"I164*G11","v":0},{"$f":"I164*G13","v":0},{"$f":"J164*'CTI Input Sheet'!B28","v":0},{"$f":"J164*'CTI Input Sheet'!C28","v":0},{"$f":"J164*'CTI Input Sheet'!D28","v":0},{"$f":"SUM(K164:N164)","v":0},null,null,null,null,{"$f":"EVEN(B164*F164)","v":0},{"$f":"J164","v":0},{"$f":"O164","v":0},{"$f":"T164*'CTI Input Sheet'!K25","v":0},{"$f":"SUM(T164*H11)/60","v":0},null,{"$f":"B164","v":0},{"$f":"EVEN(Z164*4)","v":0},0,0,{"$f":"(B164*F164)","v":0},{"$f":"AD164*4","v":0},null,{"$f":"SUM(AB164*AH8)+(AC164*AH9)","v":0},{"$f":"SUM(AD164*AH10)+(AD164*AH11)","v":0},{"$f":"SUM(AG164+AH164)+(Z164*AH6)","v":0},null,{"$f":"EVEN(Z164)*AO7/60","v":0},{"$f":"AB164*AO8","v":0},{"$f":"AD164*AO9/60","v":0},{"$f":"SUM(AK164:AM164)","v":0},{"$f":"AN164*AL6","v":0}]
[null,0,null,9,4,0,0,0,{"$f":"SUM(G165+H165)*B165","v":0},{"$f":"I165*G11","v":0},{"$f":"I165*G13","v":0},{"$f":"J165*'CTI Input Sheet'!B28","v":0},{"$f":"J165*'CTI Input Sheet'!C28","v":0},{"$f":"J165*'CTI Input Sheet'!D28","v":0},0,null,null,null,null,{"$f":"EVEN(B165*F165)","v":0},{"$f":"J165","v":0},{"$f":"O165","v":0},{"$f":"T165*'CTI Input Sheet'!K25","v":0},{"$f":"SUM(T165*H11)/60","v":0},null,{"$f":"B165","v":0},0,0,0,0,{"$f":"AD165*4","v":0},null,{"$f":"SUM(AB165*AH8)+(AC165*AH9)","v":0},{"$f":"SUM(AD165*AH10)+(AD165*AH11)","v":0},{"$f":"SUM(AG165:AH165)+(Z165*AH6)","v":0},null,{"$f":"EVEN(Z165)*AO7/60","v":0},{"$f":"AB165*AO8","v":0},{"$f":"AD165*AO9/60","v":0},0,{"$f":"AN165*AL6","v":0}]
[null,0,null,12,4,0,0,0,0,{"$f":"I166*G11","v":0},{"$f":"I166*G13","v":0},{"$f":"J166*'CTI Input Sheet'!B28","v":0},{"$f":"J166*'CTI Input Sheet'!C28","v":0},{"$f":"J166*'CTI Input Sheet'!D28","v":0},0,null,null,null,null,0,0,0,{"$f":"T166*'CTI Input Sheet'!K25","v":0},{"$f":"SUM(T166*H11)/60","v":0},null,0,0,0,0,0,0,null,{"$f":"SUM(AB166*AH8)+(AC166*AH9)","v":0},{"$f":"SUM(AD166*AH10)+(AD166*AH11)","v":0},{"$f":"SUM(AG166:AH166)+(Z166*AH6)","v":0},null,{"$f":"EVEN(Z166)*AO7/60","v":0},{"$f":"AB166*AO8","v":0},{"$f":"AD166*AO9/60","v":0},0,{"$f":"AN166*AL6","v":0}]
[null,0,null,18,4,0,0,0,0,{"$f":"I167*G11","v":0},{"$f":"I167*G13","v":0},{"$f":"J167*'CTI Input Sheet'!B28","v":0},{"$f":"J167*'CTI Input Sheet'!C28","v":0},{"$f":"J167*'CTI Input Sheet'!D28","v":0},0,null,null,null,null,0,0,0,{"$f":"T167*'CTI Input Sheet'!K25","v":0},{"$f":"SUM(T167*H11)/60","v":0},null,0,0,0,0,0,0,null,{"$f":"SUM(AB167*AH8)+(AC167*AH9)","v":0},{"$f":"SUM(AD167*AH10)+(AD167*AH11)","v":0},{"$f":"SUM(AG167:AH167)+(Z167*AH6)","v":0},null,{"$f":"EVEN(Z167)*AO7/60","v":0},{"$f":"AB167*AO8","v":0},{"$f":"AD167*AO9/60","v":0},0,{"$f":"AN167*AL6","v":0}]
[null,0,null,24,4,0,0,0,0,{"$f":"I168*G11","v":0},{"$f":"I168*G13","v":0},{"$f":"J168*'CTI Input Sheet'!B28","v":0},{"$f":"J168*'CTI Input Sheet'!C28","v":0},{"$f":"J168*'CTI Input Sheet'!D28","v":0},0,null,null,null,null,0,0,0,{"$f":"T168*'CTI Input Sheet'!K25","v":0},{"$f":"SUM(T168*H11)/60","v":0},null,0,0,0,0,0,0,null,{"$f":"SUM(AB168*AH8)+(AC168*AH9)","v":0},{"$f":"SUM(AD168*AH10)+(AD168*AH11)","v":0},{"$f":"SUM(AG168:AH168)+(Z168*AH6)","v":0},null,{"$f":"EVEN(Z168)*AO7/60","v":0},{"$f":"AB168*AO8","v":0},{"$f":"AD168*AO9/60","v":0},0,{"$f":"AN168*AL6","v":0}]
[null,0,null,30,4,0,0,0,0,{"$f":"I169*G11","v":0},{"$f":"I169*G13","v":0},{"$f":"J169*'CTI Input Sheet'!B28","v":0},{"$f":"J169*'CTI Input Sheet'!C28","v":0},{"$f":"J169*'CTI Input Sheet'!D28","v":0},0,null,null,null,null,0,0,0,{"$f":"T169*'CTI Input Sheet'!K25","v":0},{"$f":"SUM(T169*H11)/60","v":0},null,0,0,0,0,0,0,null,{"$f":"SUM(AB169*AH8)+(AC169*AH9)","v":0},{"$f":"SUM(AD169*AH10)+(AD169*AH11)","v":0},{"$f":"SUM(AG169:AH169)+(Z169*AH6)","v":0},null,{"$f":"EVEN(Z169)*AO7/60","v":0},{"$f":"AB169*AO8","v":0},{"$f":"AD169*AO9/60","v":0},0,{"$f":"AN169*AL6","v":0}]
[null,0,null,36,4,0,0,0,0,{"$f":"I170*G11","v":0},{"$f":"I170*G13","v":0},{"$f":"J170*'CTI Input Sheet'!B28","v":0},{"$f":"J170*'CTI Input Sheet'!C28","v":0},{"$f":"J170*'CTI Input Sheet'!D28","v":0},0,null,null,null,null,0,0,0,{"$f":"T170*'CTI Input Sheet'!K25","v":0},{"$f":"SUM(T170*H11)/60","v":0},null,0,0,0,0,0,0,null,{"$f":"SUM(AB170*AH8)+(AC170*AH9)","v":0},{"$f":"SUM(AD170*AH10)+(AD170*AH11)","v":0},{"$f":"SUM(AG170:AH170)+(Z170*AH6)","v":0},null,{"$f":"EVEN(Z2623*AO7)/60","v":0},{"$f":"AB170*AO8","v":0},{"$f":"AD170*AO9/60","v":0},0,{"$f":"AN170*AL6","v":0}]
[null,{"$f":"SUM(B164:B170)","v":0},null,null,null,null,null,null,{"$f":"SUM(I164:I170)","v":0},0,0,0,0,0,0,null,null,null,null,{"$f":"SUM(T164:T170)","v":0},{"$f":"SUM(U164:U170)","v":0},{"$f":"SUM(V164:V170)","v":0},{"$f":"SUM(W164:W170)","v":0},{"$f":"SUM(X164:X170)","v":0},null,{"$f":"SUM(Z164:Z170)","v":0},0,0,0,0,0,null,{"$f":"SUM(AG164:AG170)","v":0},{"$f":"SUM(AH164:AH170)","v":0},{"$f":"SUM(AI164:AI170)","v":0},null,{"$f":"SUM(AK164:AK170)","v":0},{"$f":"SUM(AL164:AL170)","v":0},{"$f":"SUM(AM164:AM170)","v":0},{"$f":"SUM(AN164:AN170)","v":0},{"$f":"SUM(AO164:AO170)","v":0}]
[null,null,null,null,null,null,null,null,null,null,null,null,null,null,null,null,null,null,null,null,null,null,{"$f":"W171*'CTI Input Sheet'!H7","v":0},{"$f":"X171*'CTI Input Sheet'!H6","v":0},null,null,{"$f":"AA171*AH12","v":0},{"$f":"AB171*AH8","v":0},{"$f":"AC171*AH9","v":0},{"$f":"AD171*AH10","v":0},{"$f":"AE171*AH11","v":0},null,null,null,null,null,{"$f":"AK171*AL6","v":0},{"$f":"AL171*AL6","v":0},{"$f":"AM171*AL6","v":0}]
[null,"6\" Expansion Kits",null,"Expansion Joints",null,"TSS : Expansion Joint Support Quantity - Support Weight - Support Steel, Fabrication, Logistics, Erection Costs",null,null,null,null,null,null,null,null,null,null,null,null,null,"6\" Expansion Joint : Support Structure Summary",null,null,null,null,null,"6\" Expansion Joint : Tray Accessory Quantities",null,null,null,null,null,null,"6\" Expansion Joint : Tray Accessory Costs ",null,null,null,"6\" Expansion Joint : Tray Accessory Installation Time & Installation Cost"]
[null,"Quantities",null,"Width (in)","Hieght (in) ","Support Quantity","OS1 Str. Section Length (FT)","OS2 Str. Section Length (FT)","Total Str. Section Length (FT)","Total Str. Section Weight (LBS)","Total Str. Section Cost (USD)","Total Fabrication Cost (USD)","Total Logistic Cost (USD)","Total Erection Cost (USD","SUM TOTAL COST/FITTING",null,null,null,null,"Total Quantity of Supports","Total Weight of Supports (LB)","Total Cost of Supports (USD)","Total Design Time (HOURS)","Total Support Instal Time (HOURS)",null,"Expansion Kit Quantity (PAIRS)","Cartridge Hardware Quantity (PCS)","Hold Down Clamp Quantity (PR)","Clamp Hardware Quantity (PCS)","Expansion Guides Quantity (PR)","Guides Hardware Quantity (PCS)",null,"Hold Down Clamps Cost/Pair (USD)","Expansion Guides Cost/Pair (USD)","Total Accessory Cost (USD)",null,"TOUGHLink Time/Pair (HRS)","Hold Down Clamp Time/Pair (HRS)","Exp. Guide Time/Pair (HRS)","Total Time (HOURS)","Total Time Cost (USD)"]
[null,{"$f":"R6","v":0},null,6,6,0,0,0,{"$f":"SUM(G175+H175)*B175","v":0},{"$f":"I175*G11","v":0},{"$f":"I175*G13","v":0},{"$f":"J175*'CTI Input Sheet'!B28","v":0},{"$f":"J175*'CTI Input Sheet'!C28","v":0},{"$f":"J175*'CTI Input Sheet'!D28","v":0},{"$f":"SUM(K175:N175)","v":0},null,null,null,null,{"$f":"EVEN(B175*F175)","v":0},{"$f":"J175","v":0},{"$f":"O175","v":0},{"$f":"T175*'CTI Input Sheet'!K25","v":0},{"$f":"SUM(T175*H11)/60","v":0},null,{"$f":"B175","v":0},{"$f":"EVEN(Z175*4)","v":0},0,0,{"$f":"(B175*F175)","v":0},{"$f":"AD175*4","v":0},null,{"$f":"SUM(AB175*AH8)+(AC175*AH9)","v":0},{"$f":"SUM(AD175*AH10)+(AD175*AH11)","v":0},{"$f":"SUM(AG175+AH175)+(Z175*AH7)","v":0},null,{"$f":"EVEN(B175)*AO10/60","v":0},{"$f":"AB175*AO8","v":0},{"$f":"AD175*AO9/60","v":0},{"$f":"SUM(AK175:AM175)","v":0},{"$f":"AN175*AL6","v":0}]
[null,0,null,9,6,0,0,0,0,{"$f":"I176*G11","v":0},{"$f":"I176*G13","v":0},{"$f":"J176*'CTI Input Sheet'!B28","v":0},{"$f":"J176*'CTI Input Sheet'!C28","v":0},{"$f":"J176*'CTI Input Sheet'!D28","v":0},0,null,null,null,null,0,0,0,{"$f":"T176*'CTI Input Sheet'!K25","v":0},{"$f":"SUM(T176*H11)/60","v":0},null,0,0,0,0,{"$f":"(B176*F176)","v":0},0,null,{"$f":"SUM(AB176*AH8)+(AC176*AH9)","v":0},{"$f":"SUM(AD176*AH10)+(AD176*AH11)","v":0},{"$f":"SUM(AG176:AH176)+(Z176*AH7)","v":0},null,{"$f":"EVEN(B176)*AO10/60","v":0},{"$f":"AB176*AO8","v":0},{"$f":"AD176*AO9/60","v":0},0,{"$f":"AN176*AL6","v":0}]
[null,10,null,12,6,0,0,0,0,{"$f":"I177*G11","v":0},{"$f":"I177*G13","v":0},{"$f":"J177*'CTI Input Sheet'!B28","v":0},{"$f":"J177*'CTI Input Sheet'!C28","v":0},{"$f":"J177*'CTI Input Sheet'!D28","v":0},0,null,null,null,null,0,0,0,{"$f":"T177*'CTI Input Sheet'!K25","v":0},{"$f":"SUM(T177*H11)/60","v":0},null,10,40,0,0,0,0,null,{"$f":"SUM(AB177*AH8)+(AC177*AH9)","v":0},{"$f":"SUM(AD177*AH10)+(AD177*AH11)","v":0},{"$f":"SUM(AG177:AH177)+(Z177*AH7)","v":300},null,{"$f":"EVEN(B177)*AO10/60","v":0.16666666666666666},{"$f":"AB177*AO8","v":0},{"$f":"AD177*AO9/60","v":0},0.16666666666666666,{"$f":"AN177*AL6","v":12.5}]
[null,0,null,18,6,0,0,0,0,{"$f":"I178*G11","v":0},{"$f":"I178*G13","v":0},{"$f":"J178*'CTI Input Sheet'!B28","v":0},{"$f":"J178*'CTI Input Sheet'!C28","v":0},{"$f":"J178*'CTI Input Sheet'!D28","v":0},0,null,null,null,null,0,0,0,{"$f":"T178*'CTI Input Sheet'!K25","v":0},{"$f":"SUM(T178*H11)/60","v":0},null,0,0,0,0,0,0,null,{"$f":"SUM(AB178*AH8)+(AC178*AH9)","v":0},{"$f":"SUM(AD178*AH10)+(AD178*AH11)","v":0},{"$f":"SUM(AG178:AH178)+(Z178*AH7)","v":0},null,{"$f":"EVEN(B178)*AO10/60","v":0},{"$f":"AB178*AO8","v":0},{"$f":"AD178*AO9/60","v":0},0,{"$f":"AN178*AL6","v":0}]
[null,0,null,24,6,0,0,0,0,{"$f":"I179*G11","v":0},{"$f":"I179*G13","v":0},{"$f":"J179*'CTI Input Sheet'!B28","v":0},{"$f":"J179*'CTI Input Sheet'!C28","v":0},{"$f":"J179*'CTI Input Sheet'!D28","v":0},0,null,null,null,null,0,0,0,{"$f":"T179*'CTI Input Sheet'!K25","v":0},{"$f":"SUM(T179*H11)/60","v":0},null,0,0,0,0,0,0,null,{"$f":"SUM(AB179*AH8)+(AC179*AH9)","v":0},{"$f":"SUM(AD179*AH10)+(AD179*AH11)","v":0},{"$f":"SUM(AG179:AH179)+(Z179*AH7)","v":0},null,{"$f":"EVEN(B179)*AO10/60","v":0},{"$f":"AB179*AO8","v":0},{"$f":"AD179*AO9/60","v":0},0,{"$f":"AN179*AL6","v":0}]
[null,0,null,30,6,0,0,0,0,{"$f":"I180*G11","v":0},{"$f":"I180*G13","v":0},{"$f":"J180*'CTI Input Sheet'!B28","v":0},{"$f":"J180*'CTI Input Sheet'!C28","v":0},{"$f":"J180*'CTI Input Sheet'!D28","v":0},0,null,null,null,null,0,0,0,{"$f":"T180*'CTI Input Sheet'!K25","v":0},{"$f":"SUM(T180*H11)/60","v":0},null,0,0,0,0,0,0,null,{"$f":"SUM(AB180*AH8)+(AC180*AH9)","v":0},{"$f":"SUM(AD180*A10)+(AD180*AH11)","v":0},{"$f":"SUM(AG180:AH180)+(Z180*AH7)","v":0},null,{"$f":"EVEN(B180)*AO10/60","v":0},{"$f":"AB180*AO8","v":0},{"$f":"AD180*AO9/60","v":0},0,{"$f":"AN180*AL6","v":0}]
[null,5,null,36,6,0,0,0,0,{"$f":"I181*G11","v":0},{"$f":"I181*G13","v":0},{"$f":"J181*'CTI Input Sheet'!B28","v":0},{"$f":"J181*'CTI Input Sheet'!C28","v":0},{"$f":"J181*'CTI Input Sheet'!D28","v":0},{"$f":"SUM(K181:N181)","v":0},null,null,null,null,0,0,0,{"$f":"T181*'CTI Input Sheet'!K25","v":0},{"$f":"SUM(T181*H11)/60","v":0},null,5,20,0,0,0,0,null,{"$f":"SUM(AB181*AH8)+(AC181*AH9)","v":0},{"$f":"SUM(AD181*AH10)+(AD181*AH11)","v":0},{"$f":"SUM(AG181:AH181)+(Z181*AH7)","v":150},null,{"$f":"EVEN(B181)*AO10/60","v":0.1},{"$f":"AB181*AO8","v":0},{"$f":"AD181*AO9/60","v":0},0.1,{"$f":"AN181*AL6","v":7.5}]
[null,{"$f":"SUM(B175:B181)","v":15},null,null,null,null,null,null,{"$f":"SUM(I175:I181)","v":0},{"$f":"SUM(J175:J181)","v":0},0,0,0,0,0,null,null,null,null,{"$f":"SUM(T175:T181)","v":0},{"$f":"SUM(U175:U181)","v":0},{"$f":"SUM(V175:V181)","v":0},{"$f":"SUM(W175:W181)","v":0},{"$f":"SUM(X175:X181)","v":0},null,{"$f":"SUM(Z175:Z181)","v":15},60,0,0,0,0,null,{"$f":"SUM(AG175:AG181)","v":0},{"$f":"SUM(AH175:AH181)","v":0},{"$f":"SUM(AI175:AI181)","v":450},null,{"$f":"SUM(AK175:AK181)","v":0.26666666666666666},{"$f":"SUM(AL175:AL181)","v":0},{"$f":"SUM(AM175:AM181)","v":0},{"$f":"SUM(AN175:AN181)","v":0.26666666666666666},{"$f":"SUM(AO175:AO181)","v":20}]
[null,null,null,null,null,null,null,null,null,null,null,null,null,null,null,null,null,null,null,null,null,null,{"$f":"W182*'CTI Input Sheet'!H7","v":0},{"$f":"X182*'CTI Input Sheet'!H6","v":0},null,null,{"$f":"AA182*AH12","v":90},{"$f":"AB182*AH8","v":0},{"$f":"AC182*AH9","v":0},{"$f":"AD182*AH10","v":0},{"$f":"AE182*AH11","v":0},null,null,null,null,null,{"$f":"AK182*AL6","v":20},{"$f":"AL182*AL6","v":0},{"$f":"AM182*AL6","v":0}]
[null,"HADJ Splice Plates",null,"HADJ Splice Plates",null,"TSS : HADJ Support Quantity - Support Weight - Support Steel, Fabrication, Logistics, Erection Costs",null,null,null,null,null,null,null,null,null,null,null,null,null,"HADJ : Support Structure Summary",null,null,null,null,null,"HADJ : Tray Accessory Quantities",null,null,null,null,null,null,"HADJ : Tray Accessory Costs ",null,null,null,"HADJ : Tray Accessory Installation Time & Installation Cost"]
[null,"Quantities",null,"Hieght (in) ",null,"Support Quantity","OS1 Str. Section Length (FT)","OS2 Str. Section Length (FT)","OS3 Str. Section Length (FT)","Total Str. Section Length (FT)","Total Str. Section Weight (LBS)","Total Str. Section Cost (USD)","Total Fabrication Cost (USD)","Total Logistic Cost (USD)","Total Erection Cost (USD","SUM TOTAL COST/FITTING",null,null,null,"Total Quantity of Supports","Total Weight of Supports (LB)","Total Cost of Supports (USD)","Total Design Time (HOURS)","Total Support Instal Time (HOURS)",null,"HADJ Splice Quantity (PAIRS)","Splice Plate Hardware Quantity (PC)","Hold Down Clamp Quantity (PR)","Clamp Hardware Quantity (PC)","Expansion Guides Quantity (PR)","Guides Hardware Quantity (PC)",null,"Hold Down Clamps (PR)","Expansion Guides (PR)","Total Accessory Cost",null,"TOUGHLink Time/Pair (HRS)","Hold Down Clamp Time/Pair (HRS)","Exp. Guide Time/Pair (HRS)","Total Time (HOURS)","Total Time Cost (USD)"]
[null,{"$f":"SUM(ProjectData!G88:G89)","v":0},null,0,null,2,2.5,2.5,0,{"$f":"SUM(G186+H186)*B186","v":0},{"$f":"J186*G11","v":0},{"$f":"J186*G13","v":0},{"$f":"K186*'CTI Input Sheet'!B28","v":0},{"$f":"K186*'CTI Input Sheet'!C28","v":0},{"$f":"K186*'CTI Input Sheet'!D28","v":0},{"$f":"SUM(L186:O186)","v":0},null,null,null,{"$f":"SUM(B186*F186)","v":0},{"$f":"K186","v":0},{"$f":"P186","v":0},{"$f":"T186*'CTI Input Sheet'!K27","v":0},{"$f":"SUM(T186*H11)/60","v":0},null,{"$f":"B186*1","v":0},{"$f":"Z186*16","v":0},{"$f":"SUM(B186*F186)*1","v":0},{"$f":"AB186*4","v":0},0,0,null,{"$f":"SUM(AB186*AH8)+(AC186*AH9)","v":0},0,{"$f":"SUM(AG186:AH186)","v":0},null,{"$f":"Z186*AO6/60","v":0},{"$f":"AB186*AO8/60","v":0},0,{"$f":"SUM(AK186:AM186)","v":0},{"$f":"AN186*AL6","v":0}]
[null,{"$f":"SUM(B186:B186)","v":0},null,null,null,null,null,null,null,{"$f":"J186","v":0},{"$f":"K186","v":0},0,0,0,0,0,null,null,null,{"$f":"T186","v":0},{"$f":"U186","v":0},{"$f":"V186","v":0},{"$f":"W186","v":0},{"$f":"X186","v":0},null,{"$f":"Z186","v":0},0,0,0,0,0,null,{"$f":"AG186","v":0},{"$f":"AH186","v":0},{"$f":"AI186","v":0},null,{"$f":"SUM(AK186:AK186)","v":0},{"$f":"SUM(AL186:AL186)","v":0},{"$f":"SUM(AM186:AM186)","v":0},{"$f":"SUM(AN186:AN186)","v":0},{"$f":"SUM(AO186:AO186)","v":0}]
[null,null,null,null,null,null,null,null,null,null,null,null,null,null,null,null,null,null,null,null,null,null,{"$f":"W187*'CTI Input Sheet'!H7","v":0},{"$f":"X187*'CTI Input Sheet'!H6","v":0},null,null,{"$f":"AA187*AH12","v":0},{"$f":"AB187*AH8","v":0},{"$f":"AC187*AH9","v":0},{"$f":"AD187*AH10","v":0},{"$f":"AE187*AH11","v":0},null,null,null,null,null,{"$f":"AK187*AL6","v":0},{"$f":"AL187*AL6","v":0},{"$f":"AM187*AL6","v":0}]
[null,"VADJ Splice Plates",null,"VADJ Splice Plates",null,"TSS : VADJ Support Quantity - Support Weight - Support Steel, Fabrication, Logistics, Erection Costs",null,null,null,null,null,null,null,null,null,null,null,null,null,"VADJ : Support Structure Summary",null,null,null,null,null,"VADJ : Tray Accessory Quantities",null,null,null,null,null,null,"VADJ : Tray Accessory Costs ",null,null,null,"VADJ : Tray Accessory Installation Time & Installation Cost"]
[null,"Quantities",null,"Hieght (in) ",null,"Support Quantity","OS1 Str. Section Length (FT)","OS2 Str. Section Length (FT)","OS3 Str. Section Length (FT)","Total Str. Section Length (FT)","Total Str. Section Weight (LBS)","Total Str. Section Cost (USD)","Total Fabrication Cost (USD)","Total Logistic Cost (USD)","Total Erection Cost (USD","SUM TOTAL COST/FITTING",null,null,null,"Total Quantity of Supports","Total Weight of Supports (LB)","Total Cost of Supports (USD)","Total Design Time (HOURS)","Total Support Instal Time (HOURS)",null,"VADJ Splice Quantity (PAIRS)","Splice Plate Hardware Quantity (PC)","Hold Down Clamp Quantity (PR)","Clamp Hardware Quantity (PC)","Expansion Guides Quantity (PR)","Guides Hardware Quantity (PC)",null,"Hold Down Clamps (PR)","Expansion Guides (PR)","Total Accessory Cost",null,"TOUGHLink Time/Pair (HRS)","Hold Down Clamp Time/Pair (HRS)","Exp. Guide Time/Pair (HRS)","Total Time (HOURS)","Total Time Cost (USD)"]
[null,{"$f":"SUM(ProjectData!D88:D89)","v":0},null,0,null,1,2.5,0,0,{"$f":"G191*B191","v":0},{"$f":"J191*G11","v":0},{"$f":"J191*G13","v":0},{"$f":"K191*'CTI Input Sheet'!B28","v":0},{"$f":"K191*'CTI Input Sheet'!C28","v":0},{"$f":"K191*'CTI Input Sheet'!D28","v":0},{"$f":"SUM(L191:O191)","v":0},null,null,null,{"$f":"SUM(B191*F191)","v":0},{"$f":"K191","v":0},{"$f":"P191","v":0},{"$f":"T191*'CTI Input Sheet'!K28","v":0},{"$f":"SUM(T191*H11)/60","v":0},null,{"$f":"B191*1","v":0},{"$f":"Z191*16","v":0},{"$f":"SUM(B191*F191)*1","v":0},{"$f":"AB191*4","v":0},0,0,null,{"$f":"SUM(AB191*AH8)+(AC191*AH9)","v":0},0,{"$f":"SUM(AG191:AH191)","v":0},null,{"$f":"Z191*AO6/60","v":0},{"$f":"AB191*AO8/60","v":0},0,{"$f":"SUM(AK191:AM191)","v":0},{"$f":"AN191*AL6","v":0}]
[null,{"$f":"SUM(B191:B191)","v":0},null,null,null,null,null,null,null,{"$f":"J191","v":0},{"$f":"K191","v":0},0,0,0,0,0,null,null,null,{"$f":"T191","v":0},{"$f":"U191","v":0},{"$f":"V191","v":0},{"$f":"W191","v":0},{"$f":"X191","v":0},null,{"$f":"Z191","v":0},0,0,0,0,0,null,{"$f":"AG191","v":0},{"$f":"AH191","v":0},{"$f":"AI191","v":0},null,{"$f":"SUM(AK191:AK191)","v":0},{"$f":"SUM(AL191:AL191)","v":0},{"$f":"SUM(AM191:AM191)","v":0},{"$f":"SUM(AN191:AN191)","v":0},{"$f":"SUM(AO191:AO191)","v":0}]
[null,null,null,null,null,"TSS : Reducer Support Quantity - Support Weight - Support Steel, Fabrication, Logistics, Erection Costs",null,null,null,null,null,null,null,null,null,null,null,null,null,null,null,null,{"$f":"W192*'CTI Input Sheet'!H7","v":0},{"$f":"X192*'CTI Input Sheet'!H6","v":0},null,null,{"$f":"AA192*AH12","v":0},{"$f":"AB192*AH8","v":0},{"$f":"AC192*AH9","v":0},{"$f":"AD192*AH10","v":0},{"$f":"AE192*AH11","v":0},null,null,null,null,null,{"$f":"AK192*AL6","v":0},{"$f":"AL192*AL6","v":0},{"$f":"AM192*AL6","v":0}]
[null,"Reducers",null,null,null,null,null,null,null,null,null,null,null,null,null,null,null,null,null,"REDUCER : Support Structure Summary",null,null,null,null,null,"REDUCER : Tray Accessory Quantities",null,null,null,null,null,null,"REDUCER : Tray Accessory Costs ",null,null,null,"REDUCER : Tray Accessory Installation Time & Installation Cost"]
[null,"Quantities",null,null,null,"Support Quantity","OS1 Str. Section Length (FT)","OS2 Str. Section Length (FT)","OS3 Str. Section Length (FT)","Total Str. Section Length (FT)","Total Str. Section Weight (LBS)","Total Str. Section Cost (USD)","Total Fabrication Cost (USD)","Total Logistic Cost (USD)","Total Erection Cost (USD","SUM TOTAL COST/FITTING",null,null,null,"Total Quantity of Supports","Total Weight of Supports (LB)","Total Cost of Supports (USD)","Total Design Time (HOURS)","Total Support Instal Time (HOURS)",null,"Splice Plate Quantity (PAIRS)","Splice Plate Hardware Quantity (PC)","Hold Down Clamp Quantity (PR)","Clamp Hardware Quantity (PC)","Expansion Guides Quantity (PR)","Guides Hardware Quantity (PC)",null,"Hold Down Clamps (PR)","Expansion Guides (PR)","Total Accessory Cost",null,"TOUGHLink Time/Pair (HRS)","Hold Down Clamp Time/Pair (HRS)","Exp. Guide Time/Pair (HRS)","Total Time (HOURS)","Total Time Cost (USD)"]
[null,{"$f":"SUM(ProjectData!J88:J89)","v":0},null,null,null,1,2,0,0,{"$f":"SUM(B196*F196*G196)","v":0},{"$f":"J196*G11","v":0},{"$f":"J196*G13","v":0},{"$f":"K196*'CTI Input Sheet'!B28","v":0},{"$f":"K196*'CTI Input Sheet'!C28","v":0},{"$f":"K196*'CTI Input Sheet'!D28","v":0},{"$f":"SUM(L196:O196)","v":0},null,null,null,{"$f":"SUM(B196*F196)","v":0},{"$f":"K196","v":0},{"$f":"P196","v":0},{"$f":"T196*'CTI Input Sheet'!K26","v":0},{"$f":"SUM(T196*H11)/60","v":0},null,{"$f":"B196*2","v":0},{"$f":"Z196*16","v":0},{"$f":"SUM(B196*F196)*1","v":0},{"$f":"AB196*4","v":0},0,0,null,{"$f":"SUM(AB196*AH8)+(AC196*AH9)","v":0},0,{"$f":"SUM(AG196:AH196)","v":0},null,{"$f":"Z196*AO6/60","v":0},{"$f":"AB196*AO8/60","v":0},0,{"$f":"SUM(AK196:AM196)","v":0},{"$f":"AN196*AL6","v":0}]
[null,{"$f":"B196","v":0},null,null,null,null,null,null,null,{"$f":"J196","v":0},{"$f":"K196","v":0},0,0,0,0,0,null,null,null,{"$f":"SUM(T196:T196)","v":0},{"$f":"SUM(U196:U196)","v":0},{"$f":"SUM(V196:V196)","v":0},{"$f":"SUM(W196:W196)","v":0},{"$f":"SUM(X196:X196)","v":0},null,{"$f":"SUM(Z196:Z196)","v":0},0,0,0,0,0,null,{"$f":"SUM(AG196:AG196)","v":0},{"$f":"SUM(AH196:AH196)","v":0},{"$f":"SUM(AI196:AI196)","v":0},null,{"$f":"SUM(AK196:AK196)","v":0},{"$f":"SUM(AL196:AL196)","v":0},{"$f":"SUM(AM196:AM196)","v":0},{"$f":"SUM(AN196:AN196)","v":0},{"$f":"SUM(AO196:AO196)","v":0}]
[null,null,null,null,null,null,null,null,null,null,null,null,null,null,null,null,null,null,null,null,null,null,{"$f":"W197*'CTI Input Sheet'!H7","v":0},{"$f":"X197*'CTI Input Sheet'!H6","v":0},null,null,{"$f":"AA197*AH12","v":0},{"$f":"AB197*AH8","v":0},{"$f":"AC197*AH9","v":0},{"$f":"AD197*AH10","v":0},{"$f":"AE197*AH11","v":0},null,null,null,null,null,{"$f":"AK197*AL6","v":0},{"$f":"AL197*AL6","v":0},{"$f":"AM197*AL6","v":0}]
[]
[]
[null,"TOTAL TSS COST:",null,{"$f":"SUM(E214+E218+E221+E225+E227+E229+E231+E233+E235+E237+E239)","v":11520.125}]
[null,"TSS SAVING:",null,{"$f":"SUM('VE2'!D201)-D201","v":9684.994999999999}]
[null,"TOTAL TSS HRS:",null,{"$f":"SUM(E216+E220+E226+E232+E238)","v":78.250000000000014}]
[null,"TSS SAVING:",null,{"$f":"SUM('VE2'!D203)-D203","v":64.333166666666656}]
[]
[]
[]
["TSS SHEET SUM TOTALS",null,null,null,null,null,null,null,"TSS SAVINGS %  Savings vs VE2",null,null,null,"TSS SAVINGS %  Savings vs VE2"]
[]
[null,"SUPPORT QUANTITY (EA):",null,null,{"$f":"SUM(T24+T35+T60+T85+T110+T135+T160+T171+T182+T187+T192+T197)","v":71},null,null,null,"SUPPORT QUANTITY (EA):",null,{"$f":"('VE2'!E210/TSS!E210)-1","v":0.676056338028169},{"$f":"('VE2'!E210-TSS!E210)","v":48},"COVER WEIGHT (LBS)",null,{"$f":"IF(ProjectData!H$17=\"Not Required\",0,('VE2'!O275/O275)-1)","v":0},{"$f":"('VE2'!O275-TSS!O275)","v":0}]
[]
[null,"SUPPORT STRUCTURE WEIGHT (LBS):",null,null,{"$f":"SUM(U24+U35+U60+U85+U110+U135+U160+U171+U182+U187+U192+U197)","v":613.69999999999993},null,null,null,"SUPPORT STRUCTURE WEIGHT (LBS):",null,{"$f":"('VE2'!E212/TSS!E212)-1","v":1.0996904024767802},{"$f":"('VE2'!E212-TSS!E212)","v":674.88},"COVER CLAMP WEIGHT (LBS)",null,{"$f":"IF(ProjectData!H$17=\"Not Required\",0,('VE2'!P275/P275)-1)","v":0},{"$f":"('VE2'!P275-TSS!P275)","v":0}]
[null,"SUPPORT STRUCTURE LINEAR LENGTH (FT):",null,null,{"$f":"G24+G35+J60+K85+L110+I135+I160+I171+I182+J187+J192+J197","v":161.5},null,null,null,"SUPPORT STRUCTURE LINEAR LENGTH (FT):",null,{"$f":"('VE2'!E213/TSS!E213)-1","v":1.0996904024767802},{"$f":"('VE2'!E213-TSS!E213)","v":177.60000000000002}]
[null,"SUPPORT STRUCTURE MATERIAL COST (USD)",null,null,{"$f":"SUM(V24+V35+V60+V85+V110+V135+V160+V171+V182+V187+V192+V197)","v":4163.375},null,null,null,"SUPPORT STRUCTURE MATERIAL COST (USD)",null,{"$f":"('VE2'!E214/TSS!E214)-1","v":0.94083285795778671},{"$f":"('VE2'!E214-TSS!E214)","v":3917.04},"COVER CLAMP QTY (PCS)",null,{"$f":"IFERROR(IF(ProjectData!H$17=\"Not Required\",0,('VE2'!M275/M275)-1),\"Infinite\")","v":0},{"$f":"('VE2'!M275-TSS!M275)","v":0}]
[null,"(does not include installation cost)",null,null,null,null,null,null,"(does not include installation cost)"]
[null,"SUPPORT STRUCTURE DESIGN TIME (HRS):",null,null,{"$f":"SUM(W24+W35+W60+W85+W110+W135+W160+W171+W182+W187+W192+W197)","v":56.25},null,null,null,"SUPPORT STRUCTURE DESIGN TIME (HRS):",null,{"$f":"('VE2'!E216/TSS!E216)-1","v":0.78222222222222215},null,"COVER CLAMP  HDWR QTY (PCS)",null,{"$f":"IF(ProjectData!H$17=\"Not Required\",0,('VE2'!N275/N275)-1)","v":0},{"$f":"('VE2'!N275-TSS!N275)","v":0}]
[]
[null,"SUPPORT STRUCTURE DESIGN TIME COST (USD):",null,null,{"$f":"SUM(W25+W36+W61+W86+W111+W136+W161+W172+W183+W188+W193+W198)","v":4218.75},null,null,null,"SUPPORT STRUCTURE DESIGN TIME COST (USD):",null,{"$f":"('VE2'!E218/TSS!E218)-1","v":0.78222222222222215},{"$f":"('VE2'!E218-TSS!E218)","v":3300},"COVER CLAMP  COST (PCS)",null,{"$f":"IF(ProjectData!H$17=\"Not Required\",0,('VE2'!Q275/Q275)-1)","v":0},{"$f":"('VE2'!Q275-TSS!Q275)","v":0}]
[]
[null,"SUPPORT STRUCTURE INSTALLATION TIME (HRS):",null,null,{"$f":"SUM(X24+X35+X60+X85+X110+X135+X160+X171+X182+X187+X192+X197)","v":17.75},null,null,null,"SUPPORT STRUCTURE INSTALLATION TIME (HRS):",null,{"$f":"('VE2'!E220/TSS!E220)-1","v":0.676056338028169},null,"COVER INSTAL COST (USD)",null,{"$f":"IF(ProjectData!H$17=\"Not Required\",0,('VE2'!T275/T275)-1)","v":0},{"$f":"('VE2'!T275-TSS!T275)","v":0}]
[null,"SUPPORT STRUCTURE INSTALLATION COST (USD):",null,null,{"$f":"SUM(X25+X36+X61+X86+X111+X136+X161+X172+X183+X188+X193+X198)","v":1331.25},null,null,null,"SUPPORT STRUCTURE INSTALLATION COST (USD):",null,{"$f":"('VE2'!E221/TSS!E221)-1","v":0.676056338028169},{"$f":"('VE2'!E221-TSS!E221)","v":900}]
[null,"SPLICE PLATES QUANTITY (PRS):",null,null,{"$f":"SUM(Z24+Z35+Z60+Z85+Z110+Z135+Z160+Z171+Z182+Z187+Z192+Z197)","v":15},null,null,null,"SPLICE PLATES QUANTITY (PRS):",null,{"$f":"('VE2'!E222/TSS!E222)-1","v":5.5333333333333332},{"$f":"('VE2'!E222-TSS!E222)","v":83},"COVER INSTAL TIME (HRS)",null,{"$f":"IF(ProjectData!H$17=\"Not Required\",0,('VE2'!R275/R275)-1)","v":0},{"$f":"('VE2'!R275-TSS!R275)","v":0}]
[]
[null,"SPLICE PLATES HARDWARE QUANTITY (PCS):",null,null,{"$f":"E222*16","v":240},null,null,null,"SPLICE PLATES HARDWARE QUANTITY (PCS):",null,{"$f":"('VE2'!E224/TSS!E224)-1","v":5.5333333333333332}]
[null,"SPLICE PLATES HARDWARE COST (USD)",null,null,{"$f":"SUM(AA25+AA36+AA61+AA86+AA111+AA136+AA161+AA172+AA183+AA188+AA193+AA198)","v":630},null,null,null,"SPLICE PLATES HARDWARE COST (USD)",null,{"$f":"('VE2'!E225/TSS!E225)-1","v":0.8666666666666667},{"$f":"('VE2'!E225-TSS!E225)","v":546},"TSS SAVINGS %  vs.  NEMA VE-2"]
[null,"SPLICE PLATES INSTALLATION TIME (HRS)",null,null,{"$f":"SUM(AK24+AK35+AK60+AK85+AK110+AK135+AK160+AK171+AK182+AK187+AK192+AK197)","v":1.65},null,null,null,"SPLICE PLATES INSTALLATION TIME (HRS)",null,{"$f":"('VE2'!E226/TSS!E226)-1","v":4.1010101010101021}]
[null,"SPLICE PLATES INSTALLATION COST (USD)",null,null,{"$f":"SUM(AK25+AK36+AK61+AK86+AK111+AK136+AK161+AK172+AK183+AK188+AK193+AK198)","v":123.75},null,null,null,"SPLICE PLATES INSTALLATION COST (USD)",null,{"$f":"('VE2'!E227/TSS!E227)-1","v":4.1010101010101012},{"$f":"('VE2'!E227-TSS!E227)","v":507.5},"STRUT QUANTITY (FT):",null,{"$f":"IFERROR('VE2'!D294/D294-1,\"Infinite\")","v":"Infinite"},3452.25]
[null,"CLAMPS QUANTITY (PRS)",null,null,{"$f":"SUM(AB24)+(AB35)+(AB60)+(AB85)+(AB110)+(AB135)+(AB160)+(AB171)+(AB182)+(AB187)+(AB192)+(AB197)","v":42},null,null,null,"CLAMPS QUANTITY (PRS)",null,{"$f":"('VE2'!E228/TSS!E228)-1","v":0.42853571428571424},null,"STRUT WEIGHT (LBS):",null,{"$f":"IFERROR(('VE2'!D313/D313)-1,\"Infinite\")","v":"Infinite"},6559.2749999999978]
[null,"CLAMPS COST (USD)",null,null,{"$f":"SUM(AB25+AB36+AB61+AB86+AB111+AB136+AB161+AB172+AB183+AB188+AB193+AB198)","v":252},null,null,null,"CLAMPS COST (USD)",null,{"$f":"('VE2'!E229/TSS!E229)-1","v":0.19044642857142868},{"$f":"('VE2'!E229-TSS!E229)","v":47.992500000000007},"STRUT COST (USD):",null,{"$f":"IFERROR(('VE2'!H313/H313)-1,\"Infinite\")","v":"Infinite"},9838.9125000000004]
[null,"CLAMPS HARDWARE QUANTITY (PCS)",null,null,{"$f":"SUM(AC24)+(AC35)+(AC60)+(AC85)+(AC110)+(AC135)+(AC160)+(AC171)+(AC182)+(AC187)+(AC192)+(AC197)","v":168},null,null,null,"CLAMPS HARDWARE QUANTITY (PCS)",null,{"$f":"('VE2'!E230/TSS!E230)-1","v":0.42853571428571424}]
[null,"CLAMPS HARDWARE COST (USD)",null,null,{"$f":"SUM(AC25+AC36+AC61+AC86+AC111+AC136+AC161+AC172+AC183+AC188+AC193+AC198)","v":210},null,null,null,"CLAMPS HARDWARE COST (USD)",null,{"$f":"('VE2'!E231/TSS!E231)-1","v":0.42853571428571424},{"$f":"('VE2'!E231-TSS!E231)","v":89.992500000000007},"ATR QUANTITY (FT):",null,{"$f":"('VE2'!E294/E294)-1","v":1.6816901408450704},3816]
[null,"CLAMPS INSTALLATION TIME (HRS)",null,null,{"$f":"SUM(AL24+AL35+AL60+AL85+AL110+AL135+AL160+AL171+AL182+AL187+AL192+AL197)","v":1.4},null,null,null,"CLAMPS INSTALLATION TIME (HRS)",null,{"$f":"('VE2'!E232/TSS!E232)-1","v":0.42853571428571446},null,"ATR WEIGHT (LBS):",null,{"$f":"('VE2'!F313/F313)-1","v":1.6816901408450704},801.36]
[null,"CLAMP INSTALLATION COST (USD)",null,null,{"$f":"SUM(AL25+AL36+AL61+AL86+AL111+AL136+AL161+AL172+AL183+AL188+AL193+AL198)","v":105},null,null,null,"CLAMP INSTALLATION COST (USD)",null,{"$f":"('VE2'!E233/TSS!E233)-1","v":0.42853571428571424},{"$f":"('VE2'!E233-TSS!E233)","v":44.996250000000003},"ATR COST (USD):",null,{"$f":"('VE2'!I313/I313)-1","v":1.6816901408450704},9616.3200000000033]
[null,"GUIDES QUANTITY (PRS)",null,null,{"$f":"SUM(AD24)+(AD35)+(AD60)+(AD85)+(AD110)+(AD135)+(AD160)+(AD171)+(AD182)+(AD187)+(AD192)+(AD197)","v":36},null,null,null,"GUIDES QUANTITY (PRS)",null,{"$f":"('VE2'!E234/TSS!E234)-1","v":0.80545833333333317}]
[null,"GUIDES COST (USD)",null,null,{"$f":"SUM(AD25+AD36+AD61+AD86+AD111+AD136+AD161+AD172+AD183+AD188+AD193+AD198)","v":216},null,null,null,"GUIDES COST (USD)",null,{"$f":"('VE2'!E235/TSS!E235)-1","v":0.50454861111111082},{"$f":"('VE2'!E235-TSS!E235)","v":108.98249999999996},"FITTINGS QUANTITY (PCS):",null,{"$f":"('VE2'!F294/F294)-1","v":2.352112676056338},4464]
[null,"GUIDES HARDWARE QUANTITY (PCS)",null,null,{"$f":"SUM(AE24)+(AE35)+(AE60)+(AE85)+(AE110)+(AE135)+(AE160)+(AE171)+(AE182)+(AE187)+(AE192)+(AE197)","v":144},null,null,null,"GUIDES HARDWARE QUANTITY (PCS)",null,{"$f":"('VE2'!E236/TSS!E236)-1","v":0.83333333333333326}]
[null,"GUIDES HARDWARE COST (USD)",null,null,{"$f":"SUM(AE25+AE36+AE61+AE86+AE111+AE136+AE161+AE172+AE183+AE188+AE193+AE198)","v":180},null,null,null,"GUIDES HARDWARE COST (USD)",null,{"$f":"('VE2'!E237/TSS!E237)-1","v":0.83333333333333326},{"$f":"('VE2'!E237-TSS!E237)","v":150},"HDWR QUANTITY (PCS):",null,{"$f":"('VE2'!G294/G294)-1","v":-0.1619718309859155},-3312]
[null,"GUIDES INSTALLATION TIME (HRS)",null,null,{"$f":"SUM(AM24+AM35+AM60+AM85+AM110+AM135+AM160+AM171+AM182+AM187+AM192+AM197)","v":1.2000000000000002},null,null,null,"GUIDES INSTALLATION TIME (HRS)",null,{"$f":"('VE2'!E238/TSS!E238)-1","v":0.80545833333333294}]
[null,"GUIDES INSTALLATION COST (USD)",null,null,{"$f":"SUM(AM25+AM36+AM61+AM86+AM111+AM136+AM161+AM172+AM183+AM188+AM193+AM198)","v":90.000000000000014},null,null,null,"GUIDES INSTALLATION COST (USD)",null,{"$f":"('VE2'!E239/TSS!E239)-1","v":0.80545833333333272},{"$f":"('VE2'!E239-TSS!E239)","v":72.491249999999965},"INSTAL TIME (HRS):",null,{"$f":"('VE2'!H294/H294)-1","v":4.8661971830985919},93]
[null,"TOTAL TRAY HARDWARE QUANTITY (PCS):",null,null,{"$f":"SUM(E224)+(E230)+(E236)","v":552},null,null,null,"TOTAL TRAY HARDWARE QUANTITY (PCS):",null,{"$f":"('VE2'!E240/TSS!E240)-1","v":2.7536123188405792},null,"INSTAL TIME COST (USD):",null,{"$f":"('VE2'!I294/I294)-1","v":4.8661971830985919},3060]
[null,"TOTAL TRAY HARDWARE COST (USD):",null,null,{"$f":"SUM(E225+E231+E237)","v":1020},null,null,null,"TOTAL TRAY HARDWARE COST (USD):",null,{"$f":"('VE2'!E241/TSS!E241)-1","v":0.7705808823529412},{"$f":"('VE2'!E241-TSS!E241)","v":785.99250000000006},"TRAY CLAMPS (PRS):",null,{"$f":"IFERROR(('VE2'!D332/D332)-1,\"Infinite\")","v":"Infinite"},778.79909999999995]
[null,"TOTAL TRAY INSTALLATION TIME (HRS):",null,null,{"$f":"SUM(AN24+AN35+AN60+AN85+AN110+AN135+AN160+AN171+AN182+AN187+AN192+AN197)","v":4.25},null,null,null,"TOTAL TRAY INSTALLATION TIME (HRS):",null,{"$f":"('VE2'!E242/TSS!E242)-1","v":1.9607450980392152},{"$f":"('VE2'!E242-TSS!E242)","v":8.3331666666666653},"TRAY GUIDES (PRS):",null,{"$f":"IFERROR(('VE2'!E332/E332)-1,\"Infinite\")","v":"Infinite"},1130.6978999999999]
[null,null,null,null,null,null,null,null,null,null,null,null,"TRAY CLAMPS/GUIDES HDWR (PCS):",null,{"$f":"IFERROR(('VE2'!F332/F332)-1,\"Infinite\")","v":"Infinite"},7699.8940000000002]
[null,"TOTAL TRAY INSTALLATION COST (USD):",null,null,{"$f":"E242*AL6","v":318.75},null,null,null,"TOTAL TRAY INSTALLATION TIME COST (USD):",null,{"$f":"('VE2'!E244/TSS!E244)-1","v":1.9607450980392152},{"$f":"('VE2'!E244-TSS!E244)","v":624.98749999999984},"TRAY CLAMPS/GUIDES INSTAL TIME (HRS):",null,{"$f":"IFERROR(('VE2'!G332/G332)-1,\"Infinite\")","v":"Infinite"},1.0608316666666668]
[null,null,null,null,null,null,null,null,null,null,null,null,"TRAY CLAMPS/GUIDES INSTAL COST (USD):",null,{"$f":"IFERROR(('VE2'!H332/H332)-1,\"Infinite\")","v":"Infinite"},26.520791666666668]
[null,"NUMBER 40ft FLAT BED TRUCKS (EA):",null,null,{"$f":"(E212/20000)","v":3.0684999999999997E-2},null,null,null,"NUMBER 40ft FLAT BED TRUCKS (EA):",null,{"$f":"('VE2'!E246/TSS!E246)-1","v":1.0996904024767802},{"$f":"('VE2'!E246-TSS!E246)","v":3.3744000000000003E-2}]
[]
[null,"COST OF 40ft FLAT BED TRUCKS (USD):",null,null,{"$f":"SUM(E246)*AA7","v":245.48},null,null,null,"COST OF 40ft FLAT BED TRUCKS (USD):",null,{"$f":"('VE2'!E248/TSS!E248)-1","v":1.0996904024767802},{"$f":"('VE2'!E248-TSS!E248)","v":269.952},"TSS SAVINGS %  vs.  NEMA VE-2",null,null,null,"TSS SAVINGS %  vs.  NEMA VE-2"]
[]
[null,"NUMBER 30ft HOT SHOT (EA):",null,null,{"$f":"(E216/20000)","v":2.8124999999999999E-3},null,null,null,"NUMBER 30ft HOT SHOT (EA):",null,{"$f":"('VE2'!E250/TSS!E250)-1","v":35.652942222222222},{"$f":"('VE2'!E250-TSS!E250)","v":0.1002739},"HADJ & VADJ SUPPORT QTY (EA)",null,{"$f":"IFERROR(('VE2'!L289/L289)-1,\"No QTY\")","v":"No QTY"},null,"REDUCER SUPPORT QTY (EA)",null,null,{"$f":"IFERROR(('VE2'!L293/L293)-1,\"No QTY\")","v":"No QTY"}]
[null,null,null,null,null,null,null,null,null,null,null,null,"HADJ & VADJ SUPPORT WEIGHT (LBS)",null,{"$f":"IFERROR(('VE2'!M$289/M$289)-1,\"No QTY\")","v":"No QTY"},null,"REDUCER SUPPORT WEIGHT (LBS)",null,null,{"$f":"IFERROR(('VE2'!M$293/M$293)-1,\"No QTY\")","v":"No QTY"}]
[null,"COST OF 30ft HOT SHOT (USD):",null,null,{"$f":"E250*AA6","v":15.46875},null,null,null,"COST OF 30ft HOT SHOT (USD):",null,{"$f":"('VE2'!E252/TSS!E252)-1","v":35.652942222222222},{"$f":"('VE2'!E252-TSS!E252)","v":551.50644999999997},"HADJ & VADJ SUPPORT COST (USD)",null,{"$f":"IFERROR(('VE2'!P$289/P$289)-1,\"No QTY\")","v":"No QTY"},null,"REDUCER SUPPORT COST (USD)",null,null,{"$f":"IFERROR(('VE2'!P$293/P$293)-1,\"No QTY\")","v":"No QTY"}]
[null,null,null,null,null,null,null,null,null,null,null,null,"HADJ & VADJ HOLD DOWN CLAMP QTY (PRS)",null,{"$f":"IFERROR(('VE2'!Q$289/Q$289)-1,\"No QTY\")","v":"No QTY"},null,"REDUCER HOLD DOWN CLAMP QTY (PRS)",null,null,{"$f":"IFERROR(('VE2'!Q$293/Q$293)-1,\"No QTY\")","v":"No QTY"}]
[null,"NUMBER 40ft CONTAINERS (EA):",null,null,{"$f":"(E220/20000)","v":8.8750000000000005E-4},null,null,null,"NUMBER 40ft CONTAINERS (EA):",null,{"$f":"('VE2'!E254/TSS!E254)-1","v":95.794741784037555},{"$f":"('VE2'!E254-TSS!E254)","v":8.5017833333333334E-2},"HADJ & VADJ HARDWARE QTY (PCS)",null,{"$f":"IFERROR(('VE2'!R$289/R$289)-1,\"No QTY\")","v":"No QTY"},null,"REDUCER HARDWARE QTY (PCS)",null,null,{"$f":"IFERROR(('VE2'!R$293/R$293)-1,\"No QTY\")","v":"No QTY"}]
[null,null,null,null,null,null,null,null,null,null,null,null,"HADJ & VADJ INSTALLATION TIME (HRS)",null,{"$f":"IFERROR(('VE2'!T$289/T$289)-1,\"No QTY\")","v":"No QTY"},null,"REDUCER INSTALLATION TIME (HRS)",null,null,{"$f":"IFERROR(('VE2'!T$293/T$293)-1,\"No QTY\")","v":"No QTY"}]
[null,"COST OF 40ft CONTAINERS (USD):",null,null,{"$f":"E254*AA8","v":8.875},null,null,null,"COST OF 40ft CONTAINERS (USD):",null,{"$f":"('VE2'!E256/TSS!E256)-1","v":95.794741784037555},{"$f":"('VE2'!E256-TSS!E256)","v":850.17833333333328},"HADJ & VADJ INSTALLATION COST (USD)",null,{"$f":"IFERROR(('VE2'!U$289/U$289)-1,\"No QTY\")","v":"No QTY"},null,"REDUCER INSTALLATION COST (USD)",null,null,{"$f":"IFERROR(('VE2'!U$293/U$293)-1,\"No QTY\")","v":"No QTY"}]
[]
[]
["TRAY ACCESSORY HARDWARE QUANTITY (pcs) BY ITEM",null,null,null,null,null,null,null,null,null,"COVERS QUANTITY SUMMARY (pcs) BY ITEM"]
[null,"ITEM",null,"SPLICE HDWR QTY","CLAMP HDWR QTY","GUIDE HDWR QTY","TOTAL HDWR QTY","TOTAL INSTAL TIME (hrs)","TOTAL TIME COST (usd)",null,"ITEM","COVERS QTY (pcs)","CLAMPS QTY (pcs)","HDWR QTY (pcs)","COVER WEIGHT (lbs)","CLAMP WEIGHT (lbs)","CLAMP COST (usd)","INSTALLATION TIME (hrs)",null,"INSTALLATION COST (usd)"]
[]
[null,"4\" STRAIGHT SECTION",null,{"$f":"AA24","v":0},{"$f":"AC24","v":0},{"$f":"AE24","v":0},{"$f":"SUM(AA24+AC24+AE24)","v":0},{"$f":"AN24","v":0},{"$f":"AO24","v":0},null,"4\" STRAIGHT SECTION",{"$f":"AQ24","v":0},0,0,0,{"$f":"AU24","v":0},0,{"$f":"AW24/60","v":0},null,{"$f":"R262*AL6","v":0}]
[null,"6\" STRAIGHT SECTION",null,{"$f":"AA35","v":360},{"$f":"AC35","v":64},{"$f":"AE35","v":144},{"$f":"SUM(AA35+AC35+AE35)","v":568},{"$f":"AN35","v":2.4833333333333334},{"$f":"AO35","v":186.25},null,"6\" STRAIGHT SECTION",{"$f":"AQ35","v":0},0,0,0,0,0,{"$f":"AW35/60","v":0},null,{"$f":"R263*AL6","v":0}]
[null,"HB",null,{"$f":"AA60","v":0},{"$f":"AC60","v":32},{"$f":"AE60","v":0},{"$f":"SUM(AA60+AC60+AE60)","v":32},{"$f":"AN60","v":0.4},{"$f":"AO60","v":30.000000000000004},null,"HB",{"$f":"AQ60","v":0},0,0,0,0,0,{"$f":"AW60/60","v":0},null,{"$f":"R264*AL6","v":0}]
[null,"HT",null,{"$f":"AA85","v":0},{"$f":"AC85","v":24},{"$f":"AE85","v":0},{"$f":"SUM(AA85+AC85+AE85)","v":24},{"$f":"AN85","v":0.30000000000000004},{"$f":"AO85","v":22.500000000000004},null,"HT",{"$f":"AQ85","v":0},0,0,0,0,0,{"$f":"AW85/60","v":0},null,{"$f":"R265*AL6","v":0}]
[null,"HX",null,{"$f":"AA110","v":0},{"$f":"AC110","v":0},{"$f":"AE110","v":0},{"$f":"SUM(AA110+AC110+AE110)","v":0},{"$f":"AN110","v":0},{"$f":"AO110","v":0},null,"HX",{"$f":"AQ110","v":0},0,0,0,0,0,{"$f":"AW110/60","v":0},null,{"$f":"R266*AL6","v":0}]
[null,"VI",null,{"$f":"AA135","v":0},{"$f":"AC135","v":24},{"$f":"AE135","v":0},{"$f":"SUM(AA135+AC135+AE135)","v":24},{"$f":"AN135","v":0.4},{"$f":"AO135","v":30},null,"VI",{"$f":"AQ135","v":0},0,0,0,0,0,{"$f":"AW135/60","v":0},null,{"$f":"R267*AL6","v":0}]
[null,"VO",null,{"$f":"AA160","v":0},{"$f":"AC160","v":24},{"$f":"AE160","v":0},{"$f":"SUM(AA160+AC160+AE160)","v":24},{"$f":"AN160","v":0.4},{"$f":"AO160","v":30},null,"VO",{"$f":"AQ160","v":0},0,0,0,0,0,{"$f":"AW160/60","v":0},null,{"$f":"R268*AL6","v":0}]
[null,"4\" EXPANSION KIT",null,{"$f":"AA171","v":0},{"$f":"AC171","v":0},{"$f":"AE171","v":0},{"$f":"SUM(AA171+AC171+AE171)","v":0},{"$f":"AN171","v":0},{"$f":"AO171","v":0}]
[null,"6\" EXPANSION KIT",null,{"$f":"AA182","v":60},{"$f":"AC182","v":0},{"$f":"AE182","v":0},{"$f":"SUM(AA182+AC182+AE182)","v":60},{"$f":"AN182","v":0.26666666666666666},{"$f":"AO182","v":20}]
[null,"HADJ",null,{"$f":"AA187","v":0},{"$f":"AC187","v":0},{"$f":"AE187","v":0},{"$f":"SUM(AA187+AC187+AE187)","v":0},{"$f":"AN187","v":0},{"$f":"AO187","v":0}]
[null,"VADJ",null,{"$f":"AA192","v":0},{"$f":"AC192","v":0},{"$f":"AE192","v":0},{"$f":"SUM(AA192+AC192+AE192)","v":0},{"$f":"AN192","v":0},{"$f":"AO192","v":0}]
[null,"REDUCER",null,{"$f":"AA197","v":0},{"$f":"AC197","v":0},{"$f":"AE197","v":0},{"$f":"SUM(AA197+AC197+AE197)","v":0},{"$f":"AN197","v":0},{"$f":"AO197","v":0}]
[]
[null,"SUM TOTALS:",null,{"$f":"SUM(D262:D273)","v":420},168,144,732,4.25,318.75,null,"SUM TOTALS:",{"$f":"SUM(L262:L268)","v":0},0,0,0,0,0,0,null,{"$f":"SUM(T262:T268)","v":0}]
[]
[]
["STRUT TRAPEZE SUPPORT : STRUT & HARDWARE QUANTITY (pcs)",null,null,null,null,null,null,null,null,null,"HADJ QUANTITY SUMMARY"]
[null,"ITEM",null,"TOTAL STRUT QTY (ft)","TOTAL ATR QTY (ft)","TOTAL FITTINGS QTY (pcs)","TOTAL HDWR QTY (pcs)","TOTAL INSTAL TIME (hrs)","TOTAL INSTAL TIME COST (usd)",null,null,"SUPPORT QTY (pcs)","SUPPORT WEIGHT (lbs)","SUPPORT DESIGN TIME (hrs)","SUPPORT INSTAL TIME (hrs)","SUPPORT COST (usd)","CLAMPS QTY (prs","TOTAL HDWR QTY (pcs)",null,"CLAMP INSTAL TIME (hrs)","CLAMP INSTAL TIME COST (usd)"]
[]
[null,"4\" ST SC  STRUT",null,0,{"$f":"(B17*E17*2.5)+(B18*E18*2.5)+(B19*E19*2.5)+(B20*E20*2.5)+(B21*E21*2.5)+(B22*E22*2.5)+(B23*E23*2.5)","v":0},{"$f":"(B17*E17*2)+(B18*E18*2)+(B19*E19*2)+(B20*E20*2)+(B21*E21*2)+(B22*E22*2)+(B23*E23*2)","v":0},{"$f":"(B17*E17*8)+(B18*E18*8)+(B19*E19*8)+(B20*E20*8)+(B21*E21*8)+(B22*E22*8)+(B23*E23*8)","v":0},{"$f":"(((B17*E17*AO12)+(B18*E18*AO12)+(B19*E19*AO12)+(B20*E20*AO12)+(B21*E21*AO12)+(B22*E22*AO12)+(B23*E23*AO12))/60)","v":0},{"$f":"H281*AL6","v":0},null,"SUM TOTALS:",{"$f":"T187","v":0},{"$f":"U187","v":0},{"$f":"W187","v":0},{"$f":"X187","v":0},{"$f":"V187","v":0},{"$f":"AB187","v":0},{"$f":"AC187","v":0},null,{"$f":"AN187","v":0},{"$f":"AO187","v":0}]
[null,"6\" ST SC  STRUT",null,0,{"$f":"(B28*E28*2.5)+(B29*E29*2.5)+(B30*E30*2.5)+(B31*E31*2.5)+(B32*E32*2.5)+(B33*E33*2.5)+(B34*E34*2.5)","v":112.5},{"$f":"(B28*E28*2)+(B29*E29*2)+(B30*E30*2)+(B31*E31*2)+(B32*E32*2)+(B33*E33*2)+(B34*E34*2)","v":90},{"$f":"(B28*E28*8)+(B29*E29*8)+(B30*E30*8)+(B31*E31*8)+(B32*E32*8)+(B33*E33*8)+(B34*E34*8)","v":360},{"$f":"(((B28*E28*AO12)+(B29*E29*AO12)+(B30*E30*AO12)+(B31*E31*AO12)+(B32*E32*AO12)+(B33*E33*AO12)+(B34*E34*AO12))/60)","v":1.5},{"$f":"H282*AL6","v":112.5}]
[null,"HB  STRUT",null,0,{"$f":"(B39*F39*2.5)+(B40*F40*2.5)+(B41*F41*2.5)+(B42*F42*2.5)+(B43*F43*2.5)+(B44*F44*2.5)+(B45*F45*2.5)+(B46*F46*2.5)+(B47*F47*2.5)+(B48*F48*2.5)+(B49*F49*2.5)+(B50*F50*2.5)+(B51*F51*2.5)+(B52*F52*2.5)+(B53*F53*2.5)+(B54*F54*2.5)+(B55*F55*2.5)+(B56*F56*2.5)+(B57*F57*2.5)+(B58*F58*2.5)+(B59*F59*2.5)","v":20},{"$f":"(B39*F39*2)+(B40*F40*2)+(B41*F41*2)+(B42*F42*2)+(B43*F43*2)+(B44*F44*2)+(B45*F45*2)+(B46*F46*2)+(B47*F47*2)+(B48*F48*2)+(B49*F49*2)+(B50*F50*2)+(B51*F51*2)+(B52*F52*2)+(B53*F53*2)+(B54*F54*2)+(B55*F55*2)+(B56*F56*2)+(B57*F57*2)+(B58*F58*2)+(B59*F59*2)","v":16},{"$f":"(B39*F39*8)+(B40*F40*8)+(B41*F41*8)+(B42*F42*8)+(B43*F43*8)+(B44*F44*8)+(B45*F45*8)+(B46*F46*8)+(B47*F47*8)+(B48*F48*8)+(B49*F49*8)+(B50*F50*8)+(B51*F51*8)+(B52*F52*8)+(B53*F53*8)+(B54*F54*8)+(B55*F55*8)+(B56*F56*8)+(B57*F57*8)+(B58*F58*8)+(B59*F59*8)","v":64},{"$f":"(((B39*F39*AO12)+(B40*F40*AO12)+(B41*F41*AO12)+(B42*F42*AO12)+(B43*F43*AO12)+(B44*F44*AO12)+(B45*F45*AO12)+(B46*F46*AO12)+(B47*F47*AO12)+(B48*F48*AO12)+(B49*F49*AO12)+(B50*F50*AO12)+(B51*F51*AO12)+(B52*F52*AO12)+(B53*F53*AO12)+(B54*F54*AO12)+(B55*F55*AO12)+(B56*F56*AO12)+(B57*F57*AO12)+(B58*F58*AO12)+(B59*F59*AO12))/60)","v":0.26666666666666666},{"$f":"H283*AL6","v":20}]
[null,"HT  STRUT",null,0,{"$f":"(B64*F64*2.5)+(B65*F65*2.5)+(B66*F66*2.5)+(B67*F67*2.5)+(B68*F68*2.5)+(B69*F69*2.5)+(B70*F70*2.5)+(B71*F71*2.5)+(B72*F72*2.5)+(B73*F73*2.5)+(B74*F74*2.5)+(B75*F75*2.5)+(B76*F76*2.5)+(B77*F77*2.5)+(B78*F78*2.5)+(B79*F79*2.5)+(B80*F80*2.5)+(B81*F81*2.5)+(B82*F82*2.5)+(B83*F83*2.5)+(B84*F84*2.5)","v":15},{"$f":"(B64*F64*2)+(B65*F65*2)+(B66*F66*2)+(B67*F67*2)+(B68*F68*2)+(B69*F69*2)+(B70*F70*2)+(B71*F71*2)+(B72*F72*2)+(B73*F73*2)+(B74*F74*2)+(B75*F75*2)+(B76*F76*2)+(B77*F77*2)+(B78*F78*2)+(B79*F79*2)+(B80*F80*2)+(B81*F81*2)+(B82*F82*2)+(B83*F83*2)+(B84*F84*2)","v":12},{"$f":"(B64*F64*8)+(B65*F65*8)+(B66*F66*8)+(B67*F67*8)+(B68*F68*8)+(B69*F69*8)+(B70*F70*8)+(B71*F71*8)+(B72*F72*8)+(B73*F73*8)+(B74*F74*8)+(B75*F75*8)+(B76*F76*8)+(B77*F77*8)+(B78*F78*8)+(B79*F79*8)+(B80*F80*8)+(B81*F81*8)+(B82*F82*8)+(B83*F83*8)+(B84*F84*8)","v":48},{"$f":"(((B64*F64*AO12)+(B65*F65*AO12)+(B66*F66*AO12)+(B67*F67*AO12)+(B68*F68*AO12)+(B69*F69*AO12)+(B70*F70*AO12)+(B71*F71*AO12)+(B72*F72*AO12)+(B73*F73*AO12)+(B74*F74*AO12)+(B75*F75*AO12)+(B76*F76*AO12)+(B77*F77*AO12)+(B78*F78*AO12)+(B79*F79*AO12)+(B80*F80*AO12)+(B81*F81*AO12)+(B82*F82*AO12)+(B83*F83*AO12)+(B84*F84*AO12))/60)","v":0.2},{"$f":"H284*AL6","v":15},null,"VADJ QUANTITY SUMMARY"]
[null,"HX  STRUT",null,0,{"$f":"(B89*F89*2.5)+(B90*F90*2.5)+(B91*F91*2.5)+(B92*F92*2.5)+(B93*F93*2.5)+(B94*F94*2.5)+(B95*F95*2.5)+(B96*F96*2.5)+(B97*F97*2.5)+(B98*F98*2.5)+(B99*F99*2.5)+(B100*F100*2.5)+(B101*F101*2.5)+(B102*F102*2.5)+(B103*F103*2.5)+(B104*F104*2.5)+(B105*F105*2.5)+(B106*F106*2.5)+(B107*F107*2.5)+(B108*F108*2.5)+(B109*F109*2.5)","v":0},{"$f":"(B89*F89*2)+(B90*F90*2)+(B91*F91*2)+(B92*F92*2)+(B93*F93*2)+(B94*F94*2)+(B95*F95*2)+(B96*F96*2)+(B97*F97*2)+(B98*F98*2)+(B99*F99*2)+(B100*F100*2)+(B101*F101*2)+(B102*F102*2)+(B103*F103*2)+(B104*F104*2)+(B105*F105*2)+(B106*F106*2)+(B107*F107*2)+(B108*F108*2)+(B109*F109*2)","v":0},{"$f":"(B89*F89*8)+(B90*F90*8)+(B91*F91*8)+(B92*F92*8)+(B93*F93*8)+(B94*F94*8)+(B95*F95*8)+(B96*F96*8)+(B97*F97*8)+(B98*F98*8)+(B99*F99*8)+(B100*F100*8)+(B101*F101*8)+(B102*F102*8)+(B103*F103*8)+(B104*F104*8)+(B105*F105*8)+(B106*F106*8)+(B107*F107*8)+(B108*F108*8)+(B109*F109*8)","v":0},{"$f":"(((B89*F89*AO12)+(B90*F90*AO12)+(B91*F91*AO12)+(B92*F92*AO12)+(B93*F93*AO12)+(B94*F94*AO12)+(B95*F95*AO12)+(B96*F96*AO12)+(B97*F97*AO12)+(B98*F98*AO12)+(B99*F99*AO12)+(B100*F100*AO12)+(B101*F101*AO12)+(B102*F102*AO12)+(B103*F103*AO12)+(B104*F104*AO12)+(B105*F105*AO12)+(B106*F106*AO12)+(B107*F107*AO12)+(B108*F108*AO12)+(B109*F109*AO12))/60)","v":0},{"$f":"H285*AL6","v":0},null,null,"SUPPORT QTY (pcs)","SUPPORT WEIGHT (lbs)","SUPPORT DESIGN TIME (hrs)","SUPPORT INSTAL TIME (hrs)","SUPPORT COST (usd)","CLAMPS QTY (prs)","TOTAL HDWR QTY (pcs)",null,"CLAMP INSTAL TIME (hrs)","CLAMP INSTAL TIME COST (usd)"]
[null,"VI  STRUT",null,0,{"$f":"(B114*F114*2.5)+(B115*F115*2.5)+(B116*F116*2.5)+(B117*F117*2.5)+(B118*F118*2.5)+(B119*F119*2.5)+(B120*F120*2.5)+(B121*F121*2.5)+(B122*F122*2.5)+(B123*F123*2.5)+(B124*F124*2.5)+(B125*F125*2.5)+(B126*F126*2.5)+(B127*F127*2.5)+(B128*F128*2.5)+(B129*F129*2.5)+(B130*F130*2.5)+(B131*F131*2.5)+(B132*F132*2.5)+(B133*F133*2.5)+(B134*F134*2.5)","v":15},{"$f":"(B114*F114*2)+(B115*F115*2)+(B116*F116*2)+(B117*F117*2)+(B118*F118*2)+(B119*F119*2)+(B120*F120*2)+(B121*F121*2)+(B122*F122*2)+(B123*F123*2)+(B124*F124*2)+(B125*F125*2)+(B126*F126*2)+(B127*F127*2)+(B128*F128*2)+(B129*F129*2)+(B130*F130*2)+(B131*F131*2)+(B132*F132*2)+(B133*F133*2)+(B134*F134*2)","v":12},{"$f":"(B114*F114*8)+(B115*F115*8)+(B116*F116*8)+(B117*F117*8)+(B118*F118*8)+(B119*F119*8)+(B120*F120*8)+(B121*F121*8)+(B122*F122*8)+(B123*F123*8)+(B124*F124*8)+(B125*F125*8)+(B126*F126*8)+(B127*F127*8)+(B128*F128*8)+(B129*F129*8)+(B130*F130*8)+(B131*F131*8)+(B132*F132*8)+(B133*F133*8)+(B134*F134*8)","v":48},{"$f":"(((B114*F114*AO12)+(B115*F115*AO12)+(B116*F116*AO12)+(B117*F117*AO12)+(B118*F118*AO12)+(B119*F119*AO12)+(B120*F120*AO12)+(B121*F121*AO12)+(B122*F122*AO12)+(B123*F123*AO12)+(B124*F124*AO12)+(B125*F125*AO12)+(B126*F126*AO12)+(B127*F127*AO12)+(B128*F128*AO12)+(B129*F129*AO12)+(B130*F130*AO12)+(B131*F131*AO12)+(B132*F132*AO12)+(B133*F133*AO12)+(B134*F134*AO12))/60)","v":0.2},{"$f":"H286*AL6","v":15}]
[null,"VO  STRUT",null,0,{"$f":"(B139*F139*2.5)+(B140*F140*2.5)+(B141*F141*2.5)+(B142*F142*2.5)+(B143*F143*2.5)+(B144*F144*2.5)+(B145*F145*2.5)+(B146*F146*2.5)+(B147*F147*2.5)+(B148*F148*2.5)+(B149*F149*2.5)+(B150*F150*2.5)+(B151*F151*2.5)+(B152*F152*2.5)+(B153*F153*2.5)+(B154*F154*2.5)+(B155*F155*2.5)+(B156*F156*2.5)+(B157*F157*2.5)+(B158*F158*2.5)+(B159*F159*2.5)","v":15},{"$f":"(B139*F139*2)+(B140*F140*2)+(B141*F141*2)+(B142*F142*2)+(B143*F143*2)+(B144*F144*2)+(B145*F145*2)+(B146*F146*2)+(B147*F147*2)+(B148*F148*2)+(B149*F149*2)+(B150*F150*2)+(B151*F151*2)+(B152*F152*2)+(B153*F153*2)+(B154*F154*2)+(B155*F155*2)+(B156*F156*2)+(B157*F157*2)+(B158*F158*2)+(B159*F159*2)","v":12},{"$f":"(B139*F139*8)+(B140*F140*8)+(B141*F141*8)+(B142*F142*8)+(B143*F143*8)+(B144*F144*8)+(B145*F145*8)+(B146*F146*8)+(B147*F147*8)+(B148*F148*8)+(B149*F149*8)+(B150*F150*8)+(B151*F151*8)+(B152*F152*8)+(B153*F153*8)+(B154*F154*8)+(B155*F155*8)+(B156*F156*8)+(B157*F157*8)+(B158*F158*8)+(B159*F159*8)","v":48},{"$f":"(((B139*F139*AO12)+(B140*F140*AO12)+(B141*F141*AO12)+(B142*F142*AO12)+(B143*F143*AO12)+(B144*F144*AO12)+(B145*F145*AO12)+(B146*F146*AO12)+(B147*F147*AO12)+(B148*F148*AO12)+(B149*F149*AO12)+(B150*F150*AO12)+(B151*F151*AO12)+(B152*F152*AO12)+(B153*F153*AO12)+(B154*F154*AO12)+(B155*F155*AO12)+(B156*F156*AO12)+(B157*F157*AO12)+(B158*F158*AO12)+(B159*F159*AO12))/60)","v":0.2},{"$f":"H287*AL6","v":15},null,"SUM TOTALS:",{"$f":"T192","v":0},{"$f":"U192","v":0},{"$f":"W192","v":0},{"$f":"X192","v":0},{"$f":"V192","v":0},{"$f":"AB192","v":0},{"$f":"AC192","v":0},null,{"$f":"AN192","v":0},{"$f":"AO192","v":0}]
[null,"4\" EXP KIT  STRUT",null,0,{"$f":"(B164*F164*2.5)+(B165*F165*2.5)+(B166*F166*2.5)+(B167*F167*2.5)+(B168*F168*2.5)+(B169*F169*2.5)+(B170*F170*2.5)","v":0},{"$f":"(B164*F164*2)+(B165*F165*2)+(B166*F166*2)+(B167*F167*2)+(B168*F168*2)+(B169*F169*2)+(B170*F170*2)","v":0},{"$f":"(B164*F164*8)+(B165*F165*8)+(B166*F166*8)+(B167*F167*8)+(B168*F168*8)+(B169*F169*8)+(B170*F170*8)","v":0},{"$f":"(((B164*F164*AO12)+(B165*F165*AO12)+(B166*F166*AO12)+(B167*F167*AO12)+(B168*F168*AO12)+(B169*F169*AO12)+(B170*F170*AO12))/60)","v":0},{"$f":"H288*AL6","v":0}]
[null,"6\" EXP KIT  STRUT",null,0,{"$f":"(B175*F175*2.5)+(B176*F176*2.5)+(B177*F177*2.5)+(B178*F178*2.5)+(B179*F179*2.5)+(B180*F180*2.5)+(B181*F181*2.5)","v":0},{"$f":"(B175*F175*2)+(B176*F176*2)+(B177*F177*2)+(B178*F178*2)+(B179*F179*2)+(B180*F180*2)+(B181*F181*2)","v":0},{"$f":"(B175*F175*8)+(B176*F176*8)+(B177*F177*8)+(B178*F178*8)+(B179*F179*8)+(B180*F180*8)+(B181*F181*8)","v":0},{"$f":"(((B175*F175*AO12)+(B176*F176*AO12)+(B177*F177*AO12)+(B178*F178*AO12)+(B179*F179*AO12)+(B180*F180*AO12)+(B181*F181*AO12))/60)","v":0},{"$f":"H289*AL6","v":0},null,"HADJ + VADJ TOTALS:",{"$f":"L281+L287","v":0},{"$f":"M281+M287","v":0},0,0,0,0,0,null,0,0]
[null,"HADJ  STRUT",null,0,{"$f":"(B186*F186*2.5)","v":0},{"$f":"(B186*F186*2)","v":0},{"$f":"(B186*F186*8)","v":0},{"$f":"(((B186*F186*AO12))/60)","v":0},{"$f":"H290*AL6","v":0},null,"REDUCER QUANTITY SUMMARY"]
[null,"VADJ  STRUT",null,0,{"$f":"(B191*F191*2.5)","v":0},{"$f":"(B191*F191*2)","v":0},{"$f":"(B191*F191*8)","v":0},{"$f":"(((B191*F191*AO12))/60)","v":0},{"$f":"H291*AL6","v":0},null,null,"SUPPORT QTY (pcs)","SUPPORT WEIGHT (lbs)","SUPPORT DESIGN TIME (hrs)","SUPPORT INSTAL TIME (hrs)","SUPPORT COST (usd)","CLAMPS QTY (pcs)","TOTAL HDWR QTY (pcs)",null,"CLAMP INSTAL TIME (hrs)","CLAMP INSTAL TIME COST (usd)"]
[null,"REDUCER  STRUT",null,0,{"$f":"(B196*F196*2.5)","v":0},{"$f":"(B196*F196*2)","v":0},{"$f":"(B196*F196*8)","v":0},{"$f":"(((B196*F196*AO12))/60)","v":0},{"$f":"H292*AL6","v":0}]
[null,null,null,null,null,null,null,null,null,null,"SUM TOTALS:",{"$f":"T197","v":0},{"$f":"U197","v":0},{"$f":"W197","v":0},{"$f":"X197","v":0},{"$f":"V197","v":0},{"$f":"AB197","v":0},{"$f":"AC197","v":0},null,{"$f":"AN197","v":0},{"$f":"AO197","v":0}]
[null,"SUM TOTALS:",null,{"$f":"SUM(D281:D292)","v":0},177.5,142,568,2.3666666666666667,177.5]
[]
[null,null,null,null,null,null,null,null,null,null,"OPTIMIZED SPANS : for 20ft STRAIGHT SECTIONS"]
["STRUT TRAPEZE SUPPORT : STRUT COST & WEIGHT",null,null,null,null,null,null,null,null,null,"SPAN","SUPPORT QTY (pcs)","SUPPORT WEIGHT (lbs)","SUPPORT COST (usd)","SUPPORT INSTAL TIME (hrs)","SPLICE QTY (pcs)","CLAMP QTY (prs)","GUIDE QTY (prs)",null,"HDWR QTY (pcs)","TRAY INSTAL TIME (hrs)","TRAY INSTAL COST (usd)","OPTIMIZATION FACTOR (%)"]
[null,"ITEM",null,"STRUT CHANNEL WEIGHT (lbs)",null,"TOTAL ATR WEIGHT (lbs)",null,"STRUT CHANNEL COST (usd)","TOTAL ATR COST (usd)"]
[null,null,null,null,null,null,null,null,null,null,"10ft",{"$f":"G35*2","v":195},{"$f":"H35*2","v":741},{"$f":"M35*2","v":5742.75},{"$f":"X35*2","v":22.5},{"$f":"Z35","v":0},{"$f":"AB35*2","v":32},{"$f":"AD35*2","v":72},null,{"$f":"SUM((AA35)+((AC35+AE35)*2))","v":776},{"$f":"SUM(((AK35)+(AL35+AM35))/60)*2","v":8.2777777777777783E-2},{"$f":"U299*AL6","v":6.2083333333333339},"(−)   50%",null,null,{"$f":"(L299-L304)/L299","v":0.5}]
[null,"4\" ST SC  STRUT",null,{"$f":"D281*G11","v":0},null,{"$f":"E281*'CTI Input Sheet'!C10","v":0},null,{"$f":"D281*G13","v":0},{"$f":"E281*'CTI Input Sheet'!E10","v":0},null,"12ft",{"$f":"G35*1.6","v":156},{"$f":"M304*1.6","v":592.80000000000007},{"$f":"N304*1.6","v":4594.2},{"$f":"O304*1.6","v":18},{"$f":"Z35","v":0},{"$f":"AB35*1.6","v":25.6},{"$f":"AD35*1.6","v":57.6},null,{"$f":"SUM((AA35)+((AC35+AE35)*1.6))","v":692.8},{"$f":"SUM(((AK35)+(AL35+AM35))/60)*1.6","v":6.6222222222222224E-2},{"$f":"U300*AL6","v":4.9666666666666668},"(−)   37%",null,null,{"$f":"(L300-L304)/L300","v":0.375}]
[null,"6\" ST SC  STRUT",null,{"$f":"D282*G11","v":0},null,{"$f":"E282*'CTI Input Sheet'!C10","v":23.625},null,{"$f":"D282*G13","v":0},{"$f":"E282*'CTI Input Sheet'!E10","v":283.5},null,"14ft",{"$f":"G35*1.4","v":136.5},{"$f":"M304*1.4","v":518.69999999999993},{"$f":"N304*1.4","v":4019.9249999999997},{"$f":"O304*1.4","v":15.749999999999998},{"$f":"Z35","v":0},{"$f":"AB35*1.4","v":22.4},{"$f":"AD35*1.4","v":50.4},null,{"$f":"SUM((AA35)+((AC35+AE35)*1.4))","v":651.20000000000005},{"$f":"SUM(((AK35)+(AL35+AM35))/60)*1.4","v":5.7944444444444444E-2},{"$f":"U301*AL6","v":4.3458333333333332},"(−)   28%",null,null,{"$f":"(L301-L304)/L301","v":0.2857142857142857}]
[null,"HB  STRUT",null,{"$f":"D283*G11","v":0},null,{"$f":"E283*'CTI Input Sheet'!C10","v":4.2},null,{"$f":"D283*G13","v":0},{"$f":"E283*'CTI Input Sheet'!E10","v":50.4},null,"16ft",{"$f":"G35*1.25","v":121.875},{"$f":"M304*1.25","v":463.125},{"$f":"N304*1.25","v":3589.21875},{"$f":"O304*1.25","v":14.0625},{"$f":"Z35","v":0},{"$f":"AB35*1.25","v":20},{"$f":"AD35*1.25","v":45},null,{"$f":"SUM((AA35)+((AC35+AE35)*1.25))","v":620},{"$f":"SUM(((AK35)+(AL35+AM35))/60)*1.25","v":5.1736111111111115E-2},{"$f":"U302*AL6","v":3.8802083333333335},"(−)   20%",null,null,{"$f":"(L302-L304)/L302","v":0.2}]
[null,"HT  STRUT",null,{"$f":"D284*G11","v":0},null,{"$f":"E284*'CTI Input Sheet'!C10","v":3.15},null,{"$f":"D284*G13","v":0},{"$f":"E284*'CTI Input Sheet'!E10","v":37.799999999999997},null,"18ft",{"$f":"G35*1.1","v":107.25000000000001},{"$f":"M304*1.1","v":407.55},{"$f":"N304*1.1","v":3158.5125000000003},{"$f":"O304*1.1","v":12.375000000000002},{"$f":"Z35","v":0},{"$f":"AB35*1.1","v":17.600000000000001},{"$f":"AD35*1.1","v":39.6},null,{"$f":"SUM((AA35)+((AC35+AE35)*1.1))","v":588.79999999999995},{"$f":"SUM(((AK35)+(AL35+AM35))/60)*1.1","v":4.5527777777777785E-2},{"$f":"U303*AL6","v":3.4145833333333337},"(−)     9%",null,null,{"$f":"(L303-L304)/L303","v":9.0909090909091023E-2}]
[null,"HX  STRUT",null,{"$f":"D285*G11","v":0},null,{"$f":"E285*'CTI Input Sheet'!C10","v":0},null,{"$f":"D285*G13","v":0},{"$f":"E285*'CTI Input Sheet'!E10","v":0},null,"20ft",{"$f":"G35","v":97.5},{"$f":"H35","v":370.5},{"$f":"M35","v":2871.375},{"$f":"X35","v":11.25},{"$f":"Z35","v":0},{"$f":"AB35","v":16},{"$f":"AD35","v":36},null,{"$f":"SUM(AA35)+(AC35+AE35)","v":568},{"$f":"SUM((AK35)+(AL35+AM35))/60","v":4.1388888888888892E-2},{"$f":"U304*AL6","v":3.104166666666667},"(+) 100%"]
[null,"VI  STRUT",null,{"$f":"D286*G11","v":0},null,{"$f":"E286*'CTI Input Sheet'!C10","v":3.15},null,{"$f":"D286*G13","v":0},{"$f":"E286*'CTI Input Sheet'!E10","v":37.799999999999997}]
[null,"VO  STRUT",null,{"$f":"D287*G11","v":0},null,{"$f":"E287*'CTI Input Sheet'!C10","v":3.15},null,{"$f":"D287*G13","v":0},{"$f":"E287*'CTI Input Sheet'!E10","v":37.799999999999997}]
[null,"4\" EXP KIT  STRUT",null,{"$f":"D288*G11","v":0},null,{"$f":"E288*'CTI Input Sheet'!C10","v":0},null,{"$f":"D288*G13","v":0},{"$f":"E288*'CTI Input Sheet'!E10","v":0},null,"OPTIMIZED SPANS : for 12ft STRAIGHT SECTIONS"]
[null,"6\" EXP KIT  STRUT",null,{"$f":"D289*G11","v":0},null,{"$f":"E289*'CTI Input Sheet'!C10","v":0},null,{"$f":"D289*G13","v":0},{"$f":"E289*'CTI Input Sheet'!E10","v":0},null,"SPAN","SUPPORT QTY (pcs)","SUPPORT WEIGHT (lbs)","SUPPORT COST (usd)","SUPPORT INSTAL TIME (hrs)","SPLICE QTY (pcs)","CLAMP QTY (prs)","GUIDE QTY (prs)",null,"HDWR QTY (pcs)","TRAY INSTAL TIME (hrs)","TRAY INSTAL COST (usd)","OPTIMIZATION FACTOR (%)"]
[null,"HADJ  STRUT",null,{"$f":"D290*G11","v":0},null,{"$f":"E290*'CTI Input Sheet'!C10","v":0},null,{"$f":"D290*G13","v":0},{"$f":"E290*'CTI Input Sheet'!E10","v":0}]
[null,"VADJ  STRUT",null,{"$f":"D291*G11","v":0},null,{"$f":"E291*'CTI Input Sheet'!C10","v":0},null,{"$f":"D291*G13","v":0},{"$f":"E291*'CTI Input Sheet'!E10","v":0},null,"5ft",{"$f":"G24*2.4","v":0},{"$f":"H24*2.4","v":0},{"$f":"M24*2.4","v":0},{"$f":"X24*2.4","v":0},{"$f":"Z24","v":0},{"$f":"AB24*2.4","v":0},{"$f":"AD24*2.4","v":0},null,{"$f":"SUM((AA24)+((AC24+AE24)*2.4))","v":0},{"$f":"SUM(((AK24)+(AL24+AM24))/60)*2.4","v":0},{"$f":"U310*AL6","v":0},"(−)   58%",null,null,{"$f":"(L310-L315)/L310","v":{"$error":"#DIV/0!"}}]
[null,"REDUCER  STRUT",null,{"$f":"D292*G11","v":0},null,{"$f":"E292*'CTI Input Sheet'!C10","v":0},null,{"$f":"D292*G13","v":0},{"$f":"E292*'CTI Input Sheet'!E10","v":0},null,"6ft",{"$f":"G24*2","v":0},{"$f":"M315*2","v":0},{"$f":"M24*2","v":0},{"$f":"X24*2","v":0},{"$f":"Z24","v":0},{"$f":"AB24*2","v":0},{"$f":"AD24*2","v":0},null,{"$f":"SUM((AA24)+((AC24+AE24)*2))","v":0},{"$f":"SUM(((AK24)+(AL24+AM24))/60)*2","v":0},{"$f":"U311*AL6","v":0},"(−)   50%",null,null,{"$f":"(L311-L315)/L311","v":{"$error":"#DIV/0!"}}]
[null,null,null,null,null,null,null,null,null,null,"7ft",{"$f":"G24*1.7","v":0},{"$f":"M315*1.7","v":0},{"$f":"M24*1.7","v":0},{"$f":"X24*1.7","v":0},{"$f":"Z24","v":0},{"$f":"AB24*1.7","v":0},{"$f":"AD24*1.7","v":0},null,{"$f":"SUM((AA24)+((AC24+AE24)*1.7))","v":0},{"$f":"SUM(((AK24)+(AL24+AM24))/60)*1.7","v":0},{"$f":"U312*AL6","v":0},"(−)   41%",null,null,{"$f":"(L312-L315)/L312","v":{"$error":"#DIV/0!"}}]
[null,"SUM TOTALS:",null,{"$f":"SUM(D300:D311)","v":0},null,{"$f":"SUM(F300:F311)","v":37.274999999999999},null,{"$f":"SUM(H300:H311)","v":0},{"$f":"SUM(I300:I311)","v":447.3},null,"8ft",{"$f":"G24*1.5","v":0},{"$f":"M315*1.5","v":0},{"$f":"M24*1.5","v":0},{"$f":"X24*1.5","v":0},{"$f":"Z24","v":0},{"$f":"AB24*1.5","v":0},{"$f":"AD24*1.5","v":0},null,{"$f":"SUM((AA24)+((AC24+AE24)*1.5))","v":0},{"$f":"SUM(((AK24)+(AL24+AM24))/60)*1.5","v":0},{"$f":"U313*AL6","v":0},"(−)   33%",null,null,{"$f":"(L313-L315)/L313","v":{"$error":"#DIV/0!"}}]
[null,null,null,null,null,null,null,null,null,null,"10ft",{"$f":"G24*1.2","v":0},{"$f":"M315*1.2","v":0},{"$f":"M24*1.2","v":0},{"$f":"X24*1.2","v":0},{"$f":"Z24","v":0},{"$f":"AB24*1.2","v":0},{"$f":"AD24*1.2","v":0},null,{"$f":"SUM((AA24)+((AC24+AE24)*1.2))","v":0},{"$f":"SUM(((AK24)+(AL24+AM24))/60)*1.2","v":0},{"$f":"U314*AL6","v":0},"(−)   16%",null,null,{"$f":"(L314-L315)/L314","v":{"$error":"#DIV/0!"}}]
[null,null,null,null,null,null,null,null,null,null,"12ft",{"$f":"G24","v":0},{"$f":"H24","v":0},{"$f":"M24","v":0},{"$f":"X24","v":0},{"$f":"Z24","v":0},{"$f":"AB24","v":0},{"$f":"AD24","v":0},null,{"$f":"SUM(AA24)+(AC24+AE24)","v":0},{"$f":"SUM((AK24)+(AL24+AM24))/60","v":0},{"$f":"U315*AL6","v":0},"(+) 100%"]
["STRUT TRAPEZE SUPPORT : TRAY CLAMPS & GUIDES"]
[null,"ITEM",null,"TRAY CLAMP QTY (prs)","TRAY GUIDE QTY (prs)","TOTAL HDWR QTY (pcs)","TOTAL INSTAL TIME (hrs)","INSTAL TIME COST (usd)"]
[]
[null,"4\" ST SC  STRUT",null,0,0,0,0,{"$f":"G319*AL6","v":0}]
[null,"6\" ST SC  STRUT",null,0,0,0,0,{"$f":"G320*AL6","v":0}]
[null,"HB  STRUT",null,0,0,0,0,{"$f":"G321*AL6","v":0}]
[null,"HT  STRUT",null,0,0,0,0,{"$f":"G322*AL6","v":0}]
[null,"HX  STRUT",null,0,0,0,0,{"$f":"G323*AL6","v":0}]
[null,"VI  STRUT",null,0,0,0,0,{"$f":"G324*AL6","v":0}]
[null,"VO  STRUT",null,0,0,0,0,{"$f":"G325*AL6","v":0}]
[null,"4\" EXP KIT  STRUT",null,0,0,0,0,{"$f":"G326*AL6","v":0}]
[null,"6\" EXP KIT  STRUT",null,0,0,0,0,{"$f":"G327*AL6","v":0}]
[null,"HADJ  STRUT",null,0,0,0,0,{"$f":"G328*AL6","v":0}]
[null,"VADJ  STRUT",null,0,0,0,0,{"$f":"G329*AL6","v":0}]
[null,"REDUCER  STRUT",null,0,0,0,0,{"$f":"G330*AL6","v":0}]
[]
[null,"SUM TOTALS:",null,{"$f":"SUM(D319:D330)","v":0},{"$f":"SUM(E319:E330)","v":0},{"$f":"SUM(F319:F330)","v":0},{"$f":"SUM(G319:G330)","v":0},{"$f":"SUM(H319:H330)","v":0}]
[]
[null,"TSS % SAVINGS:",null,{"$f":"('VE2'!D332-TSS!D332)/'VE2'!D332","v":1},{"$f":"('VE2'!E332-TSS!E332)/'VE2'!E332","v":1},{"$f":"('VE2'!F332-TSS!F332)/'VE2'!F332","v":1},{"$f":"('VE2'!G332-TSS!G332)/'VE2'!G332","v":1},{"$f":"('VE2'!H332-TSS!H332)/'VE2'!H332","v":1}]