{"text_format":"1","workbook":"xlsx","n_sheets":7,"sheets":["ProjectData","Summary","DropDowns","Tables","CTI Input Sheet","VE2","TSS"],"not_rendered":{"charts":12,"images":39,"macros":1,"external_links":0,"defined_names":3,"comments":0,"pivot_tables":0},"unopened":[],"bounds":{"document_bytes":16777216,"sheet_cells":100000,"rows_first":2000,"rows_last":500,"rows_between":2000,"halvings":0,"cell_chars":16384,"cell_head_chars":4096},"cells_cut":0,"cells_raw":0,"read":"whole","date_system":"1900"}

{"sheet":"ProjectData","index":0,"n_rows":90,"n_cols":10,"rows_kept":90,"cut":false,"hidden":false,"merged":[[87,7,88,7],[15,4,15,5],[16,4,16,5],[15,7,15,8],[16,7,16,8],[39,7,41,7],[42,7,44,7],[45,7,47,7],[48,7,50,7],[51,7,53,7],[78,4,80,4],[36,4,38,4],[39,4,41,4],[42,4,44,4],[45,4,47,4],[48,4,50,4],[87,1,88,1],[87,4,88,4],[58,13,58,15],[2,1,2,9],[85,1,85,3],[85,4,85,6],[85,13,85,15],[54,7,56,7],[11,4,11,5],[11,1,11,2],[12,7,12,8],[34,1,34,3],[34,4,34,6],[34,7,34,9],[36,7,38,7],[85,7,85,9],[51,4,53,4],[54,4,56,4],[58,4,58,6],[60,4,62,4],[63,4,65,4],[66,4,68,4],[69,4,71,4],[72,4,74,4],[75,4,77,4],[72,1,74,1],[75,1,77,1],[78,1,80,1],[58,1,58,3],[51,1,53,1],[54,1,56,1],[60,1,62,1],[63,1,65,1],[66,1,68,1],[39,1,41,1],[42,1,44,1],[45,1,47,1],[48,1,50,1],[69,1,71,1],[21,1,21,2],[21,4,21,5],[29,13,29,14],[22,7,29,9],[36,1,38,1],[6,5,6,6],[29,17,29,18],[13,16,13,17],[12,4,12,5],[34,13,34,15]]}
[]
[]
[null,"TOUGH Support Savings Calculator"]
[]
[]
[]
{"$rows_left_out":85}
{"sheet":"Summary","index":1,"n_rows":348,"n_cols":15,"rows_kept":348,"cut":false,"hidden":false,"merged":[[347,11,350,14],[343,11,345,14],[334,11,336,12],[338,11,340,12],[0,0,42,8],[330,11,332,12],[319,11,321,12],[323,11,325,12],[327,11,328,12],[315,11,317,14]]}
[null,null,null,null,null,null,null,null,null,null,{"$f":"TODAY()","v":"2024-04-01"}]
[]
[]
[]
[null,null,null,null,null,null,null,null,null,null,null,"Tray Length",{"$f":"IF(SUM(ProjectData!C24:C30)>0,\"12ft\",IF(SUM(ProjectData!F24:F30)>0,\"20ft\",\"Both\"))","v":"20ft"}]
[null,null,null,null,null,null,null,null,null,null,null,"Support Type",{"$f":"ProjectData!E13","v":"Double Strut (12G)"}]
{"$rows_left_out":343}
{"sheet":"DropDowns","index":2,"n_rows":9,"n_cols":6,"rows_kept":9,"cut":false,"hidden":true,"merged":[]}
["Cable Tray Support Structural Sections","Cable Tray Accessory Costs (USD)","Handling","Cover Selection","Project Stage","Finish"]
["Single Strut (12G)","Hold Down Clamps (PR)","30ft Hot Shot","Not Required","FEED","Pre-Galv"]
["Double Strut (12G)","Clamp Hardware  (PR)","40ft Flat Bed","Required","Project Bid","HotDip Galv"]
["C-Channel (C6x13)","Expansion Guides (PR)","40ft Container",null,"Installation","Stainless"]
["I-Beam (S8x23)","Guide Hardware (PR)",null,null,null,"Painted"]
["I-Beam (S12x50)","4\" Expansion Splice Plate (PR)"]
{"$rows_left_out":4}
{"sheet":"Tables","index":3,"n_rows":93,"n_cols":141,"rows_kept":93,"cut":false,"hidden":true,"merged":[[19,34,19,41],[20,34,20,35],[20,36,20,37],[20,38,20,39],[20,40,20,41],[33,2,34,2],[28,1,34,1],[19,1,25,1],[28,2,31,2],[28,4,28,11],[28,13,28,18],[28,26,28,33],[29,4,29,5],[29,6,29,7],[29,8,29,9],[29,10,29,11],[29,13,29,14],[29,15,29,16],[29,17,29,18],[29,26,29,27],[29,28,29,29],[29,30,29,31],[20,26,20,27],[20,28,20,29],[20,30,20,31],[20,32,20,33],[2,23,2,24],[2,21,2,22],[2,19,2,20],[19,19,19,24],[20,19,20,20],[20,21,20,22],[20,23,20,24],[19,4,19,11],[20,10,20,11],[37,10,37,11],[19,2,22,2],[19,13,19,18],[20,13,20,14],[20,15,20,16],[20,17,20,18],[1,1,1,2],[35,4,35,7],[2,2,3,2],[2,1,3,1],[2,13,2,14],[2,15,2,16],[2,17,2,18],[1,13,1,18],[2,4,2,5],[2,6,2,7],[2,8,2,9],[1,4,1,11],[2,10,2,11],[47,4,47,27],[29,32,29,33],[28,34,28,41],[29,34,29,35],[29,36,29,37],[37,29,37,30],[37,31,37,32],[36,29,36,32],[24,2,25,2],[28,19,28,24],[29,19,29,20],[29,21,29,22],[29,23,29,24],[29,38,29,39],[29,40,29,41],[48,22,48,23],[19,42,19,47],[20,42,20,43],[20,44,20,45],[20,46,20,47],[19,26,19,33],[50,1,55,1],[39,1,44,1],[37,26,38,27],[39,26,39,27],[40,26,40,27],[41,26,41,27],[42,26,42,27],[43,26,43,27],[44,26,44,27],[48,26,49,27],[50,26,50,27],[51,26,51,27],[52,26,52,27],[53,26,53,27],[54,26,54,27],[55,26,55,27],[48,2,49,2],[47,1,47,2],[48,24,48,25],[48,1,49,1],[36,1,36,2],[37,1,38,1],[37,2,38,2],[36,4,36,27],[37,4,37,5],[37,6,37,7],[37,8,37,9],[37,12,37,13],[37,14,37,15],[37,16,37,17],[37,18,37,19],[37,20,37,21],[37,22,37,23],[37,24,37,25],[48,4,48,5],[48,6,48,7],[48,8,48,9],[48,12,48,13],[48,14,48,15],[48,16,48,17],[48,18,48,19],[48,20,48,21],[10,85,10,86],[10,87,10,88],[10,89,10,90],[9,77,9,90],[20,79,20,80],[20,81,20,82],[20,83,20,84],[20,85,20,86],[19,77,19,90],[20,87,20,88],[20,89,20,90],[10,81,10,82],[10,83,10,84],[20,58,20,59],[20,77,20,78],[19,92,19,111],[20,92,20,93],[20,94,20,95],[20,96,20,97],[20,98,20,99],[20,100,20,101],[20,102,20,103],[20,104,20,105],[20,106,20,107],[20,108,20,109],[20,110,20,111],[19,64,19,75],[20,64,20,65],[20,68,20,69],[20,70,20,71],[20,72,20,73],[20,74,20,75],[19,58,19,59],[19,61,19,62],[20,61,20,62],[0,42,0,47],[1,44,1,45],[1,46,1,47],[1,58,1,59],[2,61,2,62],[2,58,2,59],[2,30,2,31],[2,28,2,29],[2,26,2,27],[1,61,1,62],[1,26,1,33],[2,32,2,33],[1,42,1,43],[2,72,2,73],[2,74,2,75],[2,66,2,67],[20,66,20,67],[1,113,1,122],[19,113,19,122],[20,113,20,114],[20,115,20,116],[20,117,20,118],[20,119,20,120],[20,121,20,122],[1,92,1,111],[2,92,2,93],[2,94,2,95],[2,96,2,97],[2,98,2,99],[2,100,2,101],[2,102,2,103],[2,104,2,105],[2,106,2,107],[2,108,2,109],[2,110,2,111],[10,77,10,78],[10,79,10,80],[28,42,28,47],[29,42,29,43],[29,44,29,45],[29,46,29,47],[20,4,20,5],[20,6,20,7],[20,8,20,9],[1,64,1,75],[19,131,19,136],[20,131,20,132],[20,133,20,134],[20,135,20,136],[20,124,20,125],[20,126,20,127],[20,128,20,129],[19,124,19,129],[2,113,2,114],[2,115,2,116],[2,117,2,118],[2,119,2,120],[2,121,2,122],[2,64,2,65],[2,68,2,69],[2,70,2,71]]}
[null,null,null,null,null,null,null,null,null,null,null,null,null,null,null,null,null,null,null,null,null,null,null,null,null,null,null,null,null,null,null,null,null,null,null,null,null,null,null,null,null,null,"TRAY ACCESSORY INSTALLATION TIME (HRS)",null,null,null,null,null,null,null,null,null,null,null,null,null,null,null,null,null,null,null,null,null,null,null,null,null,null,null,null,null,null,null,null,null,null,null,null,null,null,null,"Chart or special Note (index match based on input selection) Summary Sheet",null,null,null,null,null,null,null,null,null,null,null,null,null,null,null,null,null,null,null,null,"Chart or special Note (index match based on input selection) Summary Sheet"]
[null,"CABLE TRAY BOM",null,null,"STRUCTURE",null,null,null,null,null,null,null,null,"SKILLED LABOR",null,null,null,null,null,null,null,null,null,null,null,null,"TRAY ACCESSORY QUANTITY",null,null,null,null,null,null,null,null,null,null,null,null,null,null,null,"Clamp Installation Time (HRS)",null,"Guide Installation Time (HRS)",null,"Splice/Link Installation Time (HRS)",null,null,null,null,null,null,null,null,null,null,null,"TOTAL TRAY INSTALLATION TIME (HRS)",null,null,"TOTAL TRAY INSTALLATION COST (USD)",null,null,"COVERS & COVER CLAMPS",null,null,null,null,null,null,null,null,null,null,null,null,null,null,null,null,null,null,null,null,null,null,null,null,null,null,null,"STRUT TRAPEZE SUPPORT : SUPPORT QUANTITIES - WEIGHT - TIME - COSTS ",null,null,null,null,null,null,null,null,null,null,null,null,null,null,null,null,null,null,null,null,"STRUT TRAPEZE SUPPORT : TRAY CLAMPS & GUIDES "]
[null,"Tray Item Type","Total Quantity",null,"Support Quantity (PCS)",null,"Support Weight (LBS)",null,"Support Cost (USD)",null,"Support Linear Length (FT)",null,null,"Structural Engineer Time",null,"Steel Erector Time",null,"Tray Installer Time",null,"Structural Design Cost",null,"Structure Cost",null,"Tray Installer Cost",null,null,"Clamp Quantity",null,"Guide Quantity",null,"Splice Quantity",null,"Hardware Quantity",null,null,null,null,null,null,null,null,null,"NEMA","TSS","NEMA","TSS","NEMA","TSS",null,null,null,null,null,null,null,null,null,null,"All Tray Accessory Items",null,null,"All Tray Accessory Items",null,null,"COVER WEIGHT (lbs)",null,"COVER CLAMP WEIGHT (lbs)",null,"COVER CLAMP QTY (ea)",null,"HARDWARE QTY (pcs)",null,"INSTALLATION TIME (hrs)",null,"INSTALLATION COST (usd)",null,null,null,null,null,null,null,null,null,null,null,null,null,null,null,null,null,"STRUT QUANTITY (FT)",null,"ATR QUANTITY (FT)",null,"FITTINGS QUANTITY (PCS)",null,"HDWR QUANTITY (PCS)",null,"STRUT WEIGHT (LBS)",null,"ATR WEIGHT (LBS)",null,"STRUT COST (USD)",null,"ATR COST (USD)",null,"INSTALLATION TIME (HRS)",null,"INSTALLATION COST (USD)",null,null,"CLAMP QUANTITY (PRS)",null,"GUIDE QUANTITY (PRS)",null,"HDWR QUANTITY (PCS)",null,"INSTALLATION TIME (HRS)",null,"INSTALLATION COST (USD)"]
[null,null,null,null,"NEMA","TSS","NEMA","TSS","NEMA","TSS","NEMA","TSS","Tray Item Type","NEMA","TSS","NEMA","TSS","NEMA","TSS","NEMA","TSS","NEMA","TSS","NEMA","TSS",null,"NEMA","TSS","NEMA","TSS","NEMA","TSS","NEMA","TSS",null,null,null,null,null,null,null,null,null,null,null,null,null,null,null,null,null,null,null,null,null,null,null,null,"NEMA","TSS",null,"NEMA","TSS",null,"NEMA","TSS","NEMA","TSS","NEMA","TSS","NEMA","TSS","NEMA","TSS","NEMA","TSS",null,null,null,null,null,null,null,null,null,null,null,null,null,null,null,null,"NEMA","TSS","NEMA","TSS","NEMA","TSS","NEMA","TSS","NEMA","TSS","NEMA","TSS","NEMA","TSS","NEMA","TSS","NEMA","TSS","NEMA","TSS",null,"NEMA","TSS","NEMA","TSS","NEMA","TSS","NEMA","TSS","NEMA","TSS"]
[null,null,null,null,null,null,null,null,null,null,null,null,null,null,null,null,null,null,null,null,null,null,null,null,null,null,null,null,null,null,null,null,null,null,null,null,null,null,null,null,null,null,{"$f":"'VE2'!AL24","v":0},{"$f":"TSS!AL24","v":0},{"$f":"'VE2'!AM24","v":0},{"$f":"TSS!AM24","v":0},{"$f":"'VE2'!AK24","v":0},{"$f":"TSS!AK24","v":0}]
[null,"12ft Straight Sections",{"$f":"'VE2'!B24","v":0},null,{"$f":"'VE2'!T24","v":0},{"$f":"TSS!T24","v":0},{"$f":"'VE2'!U24","v":0},{"$f":"TSS!U24","v":0},{"$f":"'VE2'!V24","v":0},{"$f":"TSS!V24","v":0},{"$f":"'VE2'!G24","v":0},{"$f":"TSS!G24","v":0},"12ft Straight Sections",{"$f":"'VE2'!W24","v":0},{"$f":"TSS!W24","v":0},{"$f":"'VE2'!X24","v":0},{"$f":"TSS!X24","v":0},{"$f":"'VE2'!AN24","v":0},{"$f":"TSS!AN24","v":0},{"$f":"N6*ProjectData!$C$16","v":0},{"$f":"O6*ProjectData!$C$16","v":0},{"$f":"P6*ProjectData!$C$15","v":0},{"$f":"Q6*ProjectData!$C$15","v":0},{"$f":"R6*ProjectData!$C$14","v":0},{"$f":"S6*ProjectData!$C$14","v":0},null,{"$f":"'VE2'!AB24","v":0},{"$f":"TSS!AB24","v":0},{"$f":"'VE2'!AD24","v":0},{"$f":"TSS!AD24","v":0},{"$f":"'VE2'!Z24","v":0},{"$f":"TSS!Z24","v":0},{"$f":"'VE2'!G262","v":0},{"$f":"TSS!G262","v":0},null,null,null,null,null,null,null,null,{"$f":"'VE2'!AL35","v":0.49995000000000001},{"$f":"TSS!AL35","v":0.53333333333333333},{"$f":"'VE2'!AM35","v":1.16655},{"$f":"TSS!AM35","v":1.2000000000000002},{"$f":"'VE2'!AK35","v":3.75},{"$f":"TSS!AK35","v":0.75},null,null,null,null,null,null,null,null,null,null,{"$f":"'VE2'!H262","v":0},{"$f":"TSS!H262","v":0},null,{"$f":"'VE2'!I262","v":0},{"$f":"TSS!I262","v":0},null,{"$f":"'VE2'!O262","v":0},{"$f":"TSS!O262","v":0},{"$f":"'VE2'!P262","v":0},{"$f":"TSS!P262","v":0},{"$f":"'VE2'!M262","v":0},{"$f":"TSS!M262","v":0},{"$f":"'VE2'!N262","v":0},{"$f":"TSS!N262","v":0},{"$f":"'VE2'!R262","v":0},{"$f":"TSS!R262","v":0},{"$f":"'VE2'!T262","v":0},{"$f":"TSS!T262","v":0},null,null,null,null,null,null,null,null,null,null,null,null,null,null,null,null,{"$f":"'VE2'!D281","v":0},{"$f":"TSS!D281","v":0},{"$f":"'VE2'!E281","v":0},{"$f":"TSS!E281","v":0},{"$f":"'VE2'!F281","v":0},{"$f":"TSS!F281","v":0},{"$f":"'VE2'!G281","v":0},{"$f":"TSS!G281","v":0},{"$f":"'VE2'!D300","v":0},{"$f":"TSS!D300","v":0},{"$f":"'VE2'!F300","v":0},{"$f":"TSS!F300","v":0},{"$f":"'VE2'!H300","v":0},{"$f":"TSS!H300","v":0},{"$f":"'VE2'!I300","v":0},{"$f":"TSS!I300","v":0},{"$f":"'VE2'!H281","v":0},{"$f":"TSS!H281","v":0},{"$f":"'VE2'!I281","v":0},{"$f":"TSS!I281","v":0},null,{"$f":"'VE2'!D319","v":0},{"$f":"TSS!D319","v":0},{"$f":"'VE2'!E319","v":0},{"$f":"TSS!E319","v":0},{"$f":"'VE2'!F319","v":0},{"$f":"TSS!F319","v":0},{"$f":"'VE2'!G319","v":0},{"$f":"TSS!G319","v":0},{"$f":"'VE2'!H319","v":0},{"$f":"TSS!H319","v":0}]
{"$rows_left_out":88}
{"sheet":"CTI Input Sheet","index":4,"n_rows":28,"n_cols":19,"rows_kept":28,"cut":false,"hidden":true,"merged":[]}
[null,null,null,"  CTI INPUTS : TOUGH Support Savings Calculator"]
[]
[null,"Support Structure Section Costs*",null,null,null,null,"Skilled Labor Rates* ",null,null,"Installation Times* ",null,null,"NEMA VE-2 Cover Clamp Costs & Installation Times & Weights"]
[null,"Type","Section Weight LB/FT","Support Instal Time MIN/PC","Section Cost USD/FT",null,"Skilled Worker Discipline","Worker Rates (USD/HR) ",null,"Cable Tray Accessory Item","Instal Time (MIN/ITEM)",null,"Cover Clamp Width","4\" Height Cost (Ea/USD)","6\" Height Cost (Ea/USD)","Installation Time (MIN)","4\" High Clamp Weight (LBS)","6\" High Clamp Weight (LBS)"]
[null,"Single Strut (12G)",1.9,15,2.85,null,"Cable Tray Installer",{"$f":"ProjectData!C14","v":75},null,"Splice Plate (PR)",5,null,"6\" Width",{"$f":"O5*0.95","v":12.824999999999999},13.5,1,0.61,0.69]
[null,"Double Strut (12G)",3.8,15,5.7,null,"Structural Steel Erector",{"$f":"ProjectData!C15","v":75},null,"TOUGHLink (PR)",1,null,"9\" Width",14.725,15.5,1,0.74,0.82]
{"$rows_left_out":23}
{"sheet":"VE2","index":5,"n_rows":332,"n_cols":49,"rows_kept":332,"cut":false,"hidden":true,"merged":[[193,42,193,48],[196,3,196,4],[11,6,11,8],[12,6,12,8],[315,0,315,8],[258,10,258,19],[295,10,295,22],[306,10,306,22],[277,0,277,8],[296,0,296,8],[277,10,277,20],[283,10,283,20],[289,10,289,20],[258,0,258,8],[195,3,195,4],[193,19,193,23],[14,19,14,23],[207,0,207,5],[185,3,185,4],[193,25,193,30],[193,32,193,34],[193,36,193,40],[194,3,194,4],[189,3,189,4],[190,3,190,4],[193,3,193,4],[192,5,192,15],[188,5,188,15],[188,19,188,23],[188,25,188,30],[188,32,188,34],[188,36,188,40],[188,3,188,4],[183,25,183,30],[183,32,183,34],[183,36,183,40],[183,5,183,15],[184,3,184,4],[61,42,61,48],[86,42,86,48],[111,42,111,48],[136,42,136,48],[172,32,172,34],[172,36,172,40],[172,25,172,30],[161,36,161,40],[161,19,161,23],[172,3,172,4],[172,5,172,14],[172,19,172,23],[161,3,161,4],[161,5,161,14],[183,3,183,4],[183,19,183,23],[3,43,3,48],[25,42,25,48],[14,42,14,48],[136,25,136,30],[161,25,161,30],[3,39,3,40],[36,32,36,34],[36,36,36,40],[61,32,61,34],[61,36,61,40],[86,32,86,34],[86,36,86,40],[111,32,111,34],[111,36,111,40],[36,42,36,48],[25,32,25,34],[25,36,25,40],[11,36,11,37],[14,32,14,34],[14,36,14,40],[136,32,136,34],[136,36,136,40],[161,32,161,34],[14,25,14,30],[3,16,3,17],[136,3,136,4],[136,5,136,14],[111,3,111,4],[111,5,111,14],[25,3,25,12],[25,14,25,15],[86,19,86,23],[111,19,111,23],[36,25,36,30],[61,25,61,30],[86,25,86,30],[111,25,111,30],[25,25,25,30],[11,25,11,27],[136,19,136,23],[3,1,10,1],[86,3,86,4],[61,5,61,16],[86,5,86,17],[36,19,36,23],[61,19,61,23],[36,3,36,4],[3,10,3,12],[36,5,36,15],[61,3,61,4],[8,10,8,12],[14,3,14,12],[14,14,14,15],[3,14,3,15],[3,19,3,20],[25,19,25,23],[8,3,8,8]]}
[null,"NEMA VE 2 Structural Support Calculator"]
[]
[null,null,null,null,null,null,null,null,null,null,null,null,null,null,"Expansion Joint Calculation (based on 50% of straight section qty)",null,null,null,null,null,null,null,null,null,null,"Logistic Rates",null,null,null,null,null,null,"Tray Accessory Costs ",null,null,null,"Customer Skilled Labor Rates",null,null,"Tray Installation Times ",null,null,null,"Cover Clamp Costs & Installation Times & Weights"]
[null,null,null,null,null,null,null,null,null,null,null,null,null,null,"4in Expansion Joint Quantities",null,"6in Expansion Joint Quantities",null,null,null,null,null,null,null,null,"Logistic Costs (USD)",null,null,null,null,null,null,"Cable Tray Accessory Costs (USD)",null,null,null,"Project Labor Cost (USD/HOUR)",null,null,"Tray Accessory Installation Time (Minutes)",null,null,null,"Cover Clamp Costs (USD) & Installation Times (MIN) & Weights (LBS)"]
[null,null,null,null,null,null,null,null,null,null,null,null,null,null,"Cable Tray Width (in)","Expansion Splice Qty (PR) ","Cable Tray Width (in)","Expansion Splice Qty (PR) ",null,null,null,null,null,null,null,"Logistic Type","Allocated Cost",null,null,null,null,null,"Cable Tray Accessory","STANDARD Tray Costs",null,null,"Skilled Worker Discipline","Labor Hourly Work Rate ",null,"Cable Tray Accessory","Allocated Installation Time",null,null,"Cover Clamp Width","4\" Height Cost (Ea/USD)","6\" Height Cost (Ea/USD)","Installation Time (MIN)","4\" High Clamp Weight (LBS)","6\" High Clamp Weight (LBS)"]
[null,null,null,null,null,null,null,null,null,null,null,null,null,null,6,{"$f":"ROUNDDOWN(((B17*12)/72),0)","v":0},6,{"$f":"ROUNDDOWN(((B28*20)/60),0)","v":0},null,null,null,null,null,null,null,"30ft HOT SHOT",{"$f":"'CTI Input Sheet'!H12","v":5500},null,null,null,null,null,"4\" Expansion Splice Plates (PR)",{"$f":"'CTI Input Sheet'!C18","v":15},null,null,"Cable Tray Installer",{"$f":"'CTI Input Sheet'!H5","v":75},null,"Splice Plates (PR)",{"$f":"'CTI Input Sheet'!K5","v":5},null,null,"6\" Width",{"$f":"'CTI Input Sheet'!N5","v":12.824999999999999},{"$f":"'CTI Input Sheet'!O5","v":13.5},{"$f":"'CTI Input Sheet'!P5","v":1},{"$f":"'CTI Input Sheet'!Q5","v":0.61},{"$f":"'CTI Input Sheet'!R5","v":0.69}]
{"$rows_left_out":327}
{"sheet":"TSS","index":6,"n_rows":334,"n_cols":49,"rows_kept":334,"cut":false,"hidden":true,"merged":[[315,0,315,8],[306,10,306,22],[295,10,295,22],[277,0,277,8],[3,42,3,48],[277,10,277,20],[283,10,283,20],[289,10,289,20],[258,10,258,19],[14,42,14,48],[25,42,25,48],[36,42,36,48],[61,42,61,48],[86,42,86,48],[111,42,111,48],[136,42,136,48],[193,19,193,23],[193,25,193,30],[193,32,193,34],[224,12,224,14],[247,12,247,14],[247,16,247,19],[193,36,193,40],[188,19,188,23],[188,25,188,30],[188,32,188,34],[188,36,188,40],[189,3,189,4],[183,19,183,23],[183,25,183,30],[183,32,183,34],[183,36,183,40],[184,3,184,4],[3,1,10,1],[3,14,3,15],[3,19,3,20],[3,39,3,40],[8,10,8,12],[11,25,11,27],[11,36,11,37],[3,16,3,17],[6,6,6,8],[8,3,8,8],[11,6,11,8],[111,36,111,40],[14,3,14,12],[14,14,14,15],[14,25,14,30],[14,32,14,34],[86,19,86,23],[86,3,86,4],[86,5,86,17],[61,3,61,4],[61,5,61,16],[61,25,61,30],[61,32,61,34],[61,19,61,23],[36,3,36,4],[36,5,36,15],[36,25,36,30],[14,19,14,23],[25,19,25,23],[36,19,36,23],[25,3,25,12],[25,25,25,30],[172,19,172,23],[172,25,172,30],[172,32,172,34],[172,36,172,40],[14,36,14,40],[111,19,111,23],[136,19,136,23],[161,19,161,23],[86,36,86,40],[61,36,61,40],[25,36,25,40],[36,32,36,34],[36,36,36,40],[86,25,86,30],[86,32,86,34],[25,32,25,34],[136,25,136,30],[136,32,136,34],[136,36,136,40],[161,25,161,30],[161,32,161,34],[161,36,161,40],[111,25,111,30],[111,32,111,34],[12,6,12,8],[296,0,296,8],[207,0,207,6],[258,0,258,8],[172,3,172,4],[172,5,172,14],[183,3,183,4],[183,5,183,15],[185,3,185,4],[188,3,188,4],[188,5,188,15],[190,3,190,4],[192,5,192,15],[193,3,193,4],[195,3,195,4],[25,14,25,15],[136,3,136,4],[136,5,136,14],[161,3,161,4],[161,5,161,14],[111,3,111,4],[111,5,111,14],[194,3,194,4]]}
[null,"TSS Structural Support Calculator"]
[]
[null,null,null,null,null,null,null,null,null,null,null,null,null,null,"MTO Expansion Joint Calculation ",null,null,null,null,null,null,null,null,null,null,"Logistic Rates",null,null,null,null,null,null,"Tray Accessory Costs ",null,null,null,"Customer Skilled Labor Rates",null,null,"Tray Installation Times ",null,null,"Cover Clamp Costs & Installation Times & Weights"]
[null,null,null,null,null,null,null,null,null,null,null,null,null,null,"4in Height Expansion Joint Quantities",null,"6in Height Expansion Joint Quantities",null,null,null,null,null,null,null,null,"Logistic Costs (USD)",null,null,null,null,null,null,"Cable Tray Accessory Costs (USD)",null,null,null,"Project Labor Cost (USD/HOUR)",null,null,"Tray Accessory Installation Time (Minutes)",null,null,"Cover Clamp Costs (USD) & Installation Times (MIN) & Weights (LBS)"]
[null,null,null,null,null,null,null,null,null,null,null,null,null,null,"Cable Tray Width (in)","Expansion Splice Qty (PR) ","Cable Tray Width (in)","Expansion Splice Qty (PR) ",null,null,null,null,null,null,null,"Logistic Type","Allocated Cost",null,null,null,null,null,"Cable Tray Accessory","TOUGHTray Costs",null,null,"Skilled Worker Discipline","Labor Hourly Work Rate ",null,"Cable Tray Accessory","Allocated Installation Time",null,"Cover Clamp Width","Fitting Cover Kit Cost (USD)","Fitting Cover Kit Instal (MIN)","TOUGHTorx Cost (Ea/USD)","Installation Time (MIN)","Fitting Cover Kit Weight (LBS)","TOUGHTorx Weight (LBS)"]
[null,null,null,null,null,null,null,null,null,null,null,null,null,null,6,{"$f":"ROUNDDOWN(((B17*12)/72),0)","v":0},6,{"$f":"ROUNDDOWN(((B28*20)/60),0)","v":0},null,null,null,null,null,null,null,"20ft Flat Bed Truck",{"$f":"'CTI Input Sheet'!H12","v":5500},null,null,null,null,null,"4\" Expansion Kit Cartridge (PRS)",{"$f":"'CTI Input Sheet'!D20","v":25},null,null,"Cable Tray Installer",{"$f":"'CTI Input Sheet'!H5","v":75},null,"TOUGHLink (PR)",{"$f":"'CTI Input Sheet'!K6","v":1},null,"6\" Width",{"$f":"'CTI Input Sheet'!N16","v":1},{"$f":"'CTI Input Sheet'!O16","v":0.2},{"$f":"'CTI Input Sheet'!P16","v":1},{"$f":"'CTI Input Sheet'!Q16","v":0.08},{"$f":"'CTI Input Sheet'!R16","v":0.1},{"$f":"'CTI Input Sheet'!S16","v":0.02}]
{"$rows_left_out":328}